Job 20529

Return at most this many characters.
Start reading the log from this character.
debug: Starting computing the channel derivation
debug: using open-inferior
debug: Acquiring advisory session lock: latest-channel-instances
debug: Finished aquiring lock latest-channel-instances, took 0 seconds
Updating channel 'guix' from Git repository at 'https://git.savannah.gnu.org/git/guix.git'...
debug: Releasing lock latest-channel-instances, spent 17 seconds
guix repl: warning: 'nix-protocol-error?' is deprecated, use 'store-protocol-error?' instead
guix repl: warning: 'nix-protocol-error-message' is deprecated, use 'store-protocol-error-message' instead
guix-data-service: computing the derivation-file-name for x86_64-linux
Computing Guix derivation for 'x86_64-linux'...  
guix-data-service: computing the derivation-file-name for i686-linux
Computing Guix derivation for 'i686-linux'...  
guix-data-service: computing the derivation-file-name for armhf-linux
Computing Guix derivation for 'armhf-linux'...  @ build-started /gnu/store/f9lydjf40zvk07nmh4zrbq96mxjgki2m-guile-gcrypt-0.3.0.drv - armhf-linux /var/log/guix/drvs/f9//lydjf40zvk07nmh4zrbq96mxjgki2m-guile-gcrypt-0.3.0.drv.bz2 20518
@ build-started /gnu/store/1v3a974h6rfgyqlwjilygi8jzl2hfxd8-guile-lzlib-0.0.2.drv - armhf-linux /var/log/guix/drvs/1v//3a974h6rfgyqlwjilygi8jzl2hfxd8-guile-lzlib-0.0.2.drv.bz2 20521
starting phase `set-SOURCE-DATE-EPOCH'
phase `set-SOURCE-DATE-EPOCH' succeeded after 0.0 seconds
starting phase `set-SOURCE-DATE-EPOCH'
phase `set-SOURCE-DATE-EPOCH' succeeded after 0.0 seconds
starting phase `set-paths'
environment variable `PATH' set to `/gnu/store/3rs3zyc4886bdp0x4dmfyhpw18w0n9km-pkg-config-0.29.2/bin:/gnu/store/b3ijxswrcsl3l4406aawbmby4nc0lc0b-autoconf-2.69/bin:/gnu/store/pwnl32gbma9xw5sjyhfv5n25c75bsl1d-automake-1.16.2/bin:/gnu/store/cd9vnmj0z9068xrgvssavnkfc8a9svly-texinfo-6.7/bin:/gnu/store/fn4rd9nwwfgkk47i82qjmsqpvp1qk8v4-guile-3.0.2/bin:/gnu/store/5r2m9qryzzzq71vdhlph4bc5d186p342-libgcrypt-1.8.5/bin:/gnu/store/am3imbjafa1wdvw9j6qabrxc09w169lz-tar-1.32/bin:/gnu/store/chqjscapsg928dy8pg6yrdhw3ypk8c9x-gzip-1.10/bin:/gnu/store/k3n5jh5579g2b17qmd2w89z2fy45pmr3-bzip2-1.0.8/bin:/gnu/store/k8ksi57ghm301zr0v7aq2vl2fa8hxfqi-xz-5.2.4/bin:/gnu/store/5ckix15mw8r509g68fbm7rla51lmd2zq-file-5.38/bin:/gnu/store/m8fnsfqs18c3srjiaw4frqadb9rqsq16-diffutils-3.7/bin:/gnu/store/2cfnrxy8icrz3sxfn86k0klmvsnj1n82-patch-2.7.6/bin:/gnu/store/0bmzacdzdhi41kkjbsq7iakwjzxkv6fm-findutils-4.7.0/bin:/gnu/store/x9qzb42hmzszg9y16m1gbz3vv54yyi00-gawk-5.0.1/bin:/gnu/store/qy7gpiba7s7ylpfxaay6i76rk892j52n-sed-4.8/bin:/gnu/store/74d5jq5sj2fhy5j0j07jqdclf8nyxgqn-grep-3.4/bin:/gnu/store/wy177cwa387g9kaf3ss716d4fhzb21wx-coreutils-8.32/bin:/gnu/store/wsxnp4k7mp7b705kxp94j7hs8as5fmsl-make-4.3/bin:/gnu/store/7zp9ifpgm3zj481nk6jg1im13g4mza2g-bash-minimal-5.0.16/bin:/gnu/store/y4iy1jvfq07gxynkb9jl1f69jmy349vi-ld-wrapper-0/bin:/gnu/store/1iwrsjwmhcdifc8i3v7qdr59k6gq4z24-binutils-2.34/bin:/gnu/store/z8954h4nvgxwcyy2in8c1l11g199m2yb-gcc-7.5.0/bin:/gnu/store/llkv94k15spryi6zf0gjm0fp7m8k3i8g-glibc-2.31/bin:/gnu/store/llkv94k15spryi6zf0gjm0fp7m8k3i8g-glibc-2.31/sbin:/gnu/store/j5g485vkgfakgr5rjnq8a10gaxcsvq1i-libgpg-error-1.37/bin'
starting phase `set-paths'
environment variable `PKG_CONFIG_PATH' set to `/gnu/store/fn4rd9nwwfgkk47i82qjmsqpvp1qk8v4-guile-3.0.2/lib/pkgconfig:/gnu/store/5r2m9qryzzzq71vdhlph4bc5d186p342-libgcrypt-1.8.5/lib/pkgconfig:/gnu/store/k8ksi57ghm301zr0v7aq2vl2fa8hxfqi-xz-5.2.4/lib/pkgconfig:/gnu/store/36c64cqp24i8i8p9m5402ig0pclmcvld-gmp-6.2.0/lib/pkgconfig:/gnu/store/f8dk4p7wlggm2p6jjgpbvri31zacnp5i-libgc-8.0.4/lib/pkgconfig:/gnu/store/j5g485vkgfakgr5rjnq8a10gaxcsvq1i-libgpg-error-1.37/lib/pkgconfig'
environment variable `PATH' set to `/gnu/store/b3ijxswrcsl3l4406aawbmby4nc0lc0b-autoconf-2.69/bin:/gnu/store/pwnl32gbma9xw5sjyhfv5n25c75bsl1d-automake-1.16.2/bin:/gnu/store/3rs3zyc4886bdp0x4dmfyhpw18w0n9km-pkg-config-0.29.2/bin:/gnu/store/fn4rd9nwwfgkk47i82qjmsqpvp1qk8v4-guile-3.0.2/bin:/gnu/store/am3imbjafa1wdvw9j6qabrxc09w169lz-tar-1.32/bin:/gnu/store/chqjscapsg928dy8pg6yrdhw3ypk8c9x-gzip-1.10/bin:/gnu/store/k3n5jh5579g2b17qmd2w89z2fy45pmr3-bzip2-1.0.8/bin:/gnu/store/k8ksi57ghm301zr0v7aq2vl2fa8hxfqi-xz-5.2.4/bin:/gnu/store/5ckix15mw8r509g68fbm7rla51lmd2zq-file-5.38/bin:/gnu/store/m8fnsfqs18c3srjiaw4frqadb9rqsq16-diffutils-3.7/bin:/gnu/store/2cfnrxy8icrz3sxfn86k0klmvsnj1n82-patch-2.7.6/bin:/gnu/store/0bmzacdzdhi41kkjbsq7iakwjzxkv6fm-findutils-4.7.0/bin:/gnu/store/x9qzb42hmzszg9y16m1gbz3vv54yyi00-gawk-5.0.1/bin:/gnu/store/qy7gpiba7s7ylpfxaay6i76rk892j52n-sed-4.8/bin:/gnu/store/74d5jq5sj2fhy5j0j07jqdclf8nyxgqn-grep-3.4/bin:/gnu/store/wy177cwa387g9kaf3ss716d4fhzb21wx-coreutils-8.32/bin:/gnu/store/wsxnp4k7mp7b705kxp94j7hs8as5fmsl-make-4.3/bin:/gnu/store/7zp9ifpgm3zj481nk6jg1im13g4mza2g-bash-minimal-5.0.16/bin:/gnu/store/y4iy1jvfq07gxynkb9jl1f69jmy349vi-ld-wrapper-0/bin:/gnu/store/1iwrsjwmhcdifc8i3v7qdr59k6gq4z24-binutils-2.34/bin:/gnu/store/z8954h4nvgxwcyy2in8c1l11g199m2yb-gcc-7.5.0/bin:/gnu/store/llkv94k15spryi6zf0gjm0fp7m8k3i8g-glibc-2.31/bin:/gnu/store/llkv94k15spryi6zf0gjm0fp7m8k3i8g-glibc-2.31/sbin'
environment variable `ACLOCAL_PATH' set to `/gnu/store/pwnl32gbma9xw5sjyhfv5n25c75bsl1d-automake-1.16.2/share/aclocal:/gnu/store/3rs3zyc4886bdp0x4dmfyhpw18w0n9km-pkg-config-0.29.2/share/aclocal:/gnu/store/fn4rd9nwwfgkk47i82qjmsqpvp1qk8v4-guile-3.0.2/share/aclocal'
environment variable `ACLOCAL_PATH' set to `/gnu/store/3rs3zyc4886bdp0x4dmfyhpw18w0n9km-pkg-config-0.29.2/share/aclocal:/gnu/store/pwnl32gbma9xw5sjyhfv5n25c75bsl1d-automake-1.16.2/share/aclocal:/gnu/store/fn4rd9nwwfgkk47i82qjmsqpvp1qk8v4-guile-3.0.2/share/aclocal:/gnu/store/5r2m9qryzzzq71vdhlph4bc5d186p342-libgcrypt-1.8.5/share/aclocal:/gnu/store/j5g485vkgfakgr5rjnq8a10gaxcsvq1i-libgpg-error-1.37/share/aclocal'
environment variable `PKG_CONFIG_PATH' set to `/gnu/store/fn4rd9nwwfgkk47i82qjmsqpvp1qk8v4-guile-3.0.2/lib/pkgconfig:/gnu/store/k8ksi57ghm301zr0v7aq2vl2fa8hxfqi-xz-5.2.4/lib/pkgconfig:/gnu/store/36c64cqp24i8i8p9m5402ig0pclmcvld-gmp-6.2.0/lib/pkgconfig:/gnu/store/f8dk4p7wlggm2p6jjgpbvri31zacnp5i-libgc-8.0.4/lib/pkgconfig'
environment variable `GUILE_LOAD_PATH' unset
environment variable `GUILE_LOAD_COMPILED_PATH' unset
environment variable `INFOPATH' set to `/gnu/store/b3ijxswrcsl3l4406aawbmby4nc0lc0b-autoconf-2.69/share/info:/gnu/store/pwnl32gbma9xw5sjyhfv5n25c75bsl1d-automake-1.16.2/share/info:/gnu/store/cd9vnmj0z9068xrgvssavnkfc8a9svly-texinfo-6.7/share/info:/gnu/store/fn4rd9nwwfgkk47i82qjmsqpvp1qk8v4-guile-3.0.2/share/info:/gnu/store/5r2m9qryzzzq71vdhlph4bc5d186p342-libgcrypt-1.8.5/share/info:/gnu/store/am3imbjafa1wdvw9j6qabrxc09w169lz-tar-1.32/share/info:/gnu/store/chqjscapsg928dy8pg6yrdhw3ypk8c9x-gzip-1.10/share/info:/gnu/store/m8fnsfqs18c3srjiaw4frqadb9rqsq16-diffutils-3.7/share/info:/gnu/store/0bmzacdzdhi41kkjbsq7iakwjzxkv6fm-findutils-4.7.0/share/info:/gnu/store/x9qzb42hmzszg9y16m1gbz3vv54yyi00-gawk-5.0.1/share/info:/gnu/store/qy7gpiba7s7ylpfxaay6i76rk892j52n-sed-4.8/share/info:/gnu/store/74d5jq5sj2fhy5j0j07jqdclf8nyxgqn-grep-3.4/share/info:/gnu/store/wy177cwa387g9kaf3ss716d4fhzb21wx-coreutils-8.32/share/info:/gnu/store/wsxnp4k7mp7b705kxp94j7hs8as5fmsl-make-4.3/share/info:/gnu/store/7zp9ifpgm3zj481nk6jg1im13g4mza2g-bash-minimal-5.0.16/share/info:/gnu/store/1iwrsjwmhcdifc8i3v7qdr59k6gq4z24-binutils-2.34/share/info:/gnu/store/z8954h4nvgxwcyy2in8c1l11g199m2yb-gcc-7.5.0/share/info:/gnu/store/llkv94k15spryi6zf0gjm0fp7m8k3i8g-glibc-2.31/share/info:/gnu/store/36c64cqp24i8i8p9m5402ig0pclmcvld-gmp-6.2.0/share/info:/gnu/store/kykplfxdjnf44pxn154d8sg30vrpdp2c-libunistring-0.9.10/share/info:/gnu/store/j5g485vkgfakgr5rjnq8a10gaxcsvq1i-libgpg-error-1.37/share/info'
environment variable `BASH_LOADABLES_PATH' unset
environment variable `GUILE_LOAD_PATH' unset
environment variable `GUILE_LOAD_COMPILED_PATH' unset
environment variable `BASH_LOADABLES_PATH' unset
environment variable `C_INCLUDE_PATH' set to `/gnu/store/fn4rd9nwwfgkk47i82qjmsqpvp1qk8v4-guile-3.0.2/include:/gnu/store/5r2m9qryzzzq71vdhlph4bc5d186p342-libgcrypt-1.8.5/include:/gnu/store/k3n5jh5579g2b17qmd2w89z2fy45pmr3-bzip2-1.0.8/include:/gnu/store/k8ksi57ghm301zr0v7aq2vl2fa8hxfqi-xz-5.2.4/include:/gnu/store/5ckix15mw8r509g68fbm7rla51lmd2zq-file-5.38/include:/gnu/store/x9qzb42hmzszg9y16m1gbz3vv54yyi00-gawk-5.0.1/include:/gnu/store/wsxnp4k7mp7b705kxp94j7hs8as5fmsl-make-4.3/include:/gnu/store/1iwrsjwmhcdifc8i3v7qdr59k6gq4z24-binutils-2.34/include:/gnu/store/z8954h4nvgxwcyy2in8c1l11g199m2yb-gcc-7.5.0/include:/gnu/store/llkv94k15spryi6zf0gjm0fp7m8k3i8g-glibc-2.31/include:/gnu/store/36c64cqp24i8i8p9m5402ig0pclmcvld-gmp-6.2.0/include:/gnu/store/f8dk4p7wlggm2p6jjgpbvri31zacnp5i-libgc-8.0.4/include:/gnu/store/il1kyhiljxf66lqy4b7sh03y7yl3i1a8-libltdl-2.4.6/include:/gnu/store/kykplfxdjnf44pxn154d8sg30vrpdp2c-libunistring-0.9.10/include:/gnu/store/j5g485vkgfakgr5rjnq8a10gaxcsvq1i-libgpg-error-1.37/include:/gnu/store/72z9rxrrmfw1xx9gf27jm2s8h5h0fkh0-linux-libre-headers-5.4.20/include'
environment variable `C_INCLUDE_PATH' set to `/gnu/store/fn4rd9nwwfgkk47i82qjmsqpvp1qk8v4-guile-3.0.2/include:/gnu/store/ggi94fcdb97561a499wx8y2lxc41cmrm-lzlib-1.12/include:/gnu/store/k3n5jh5579g2b17qmd2w89z2fy45pmr3-bzip2-1.0.8/include:/gnu/store/k8ksi57ghm301zr0v7aq2vl2fa8hxfqi-xz-5.2.4/include:/gnu/store/5ckix15mw8r509g68fbm7rla51lmd2zq-file-5.38/include:/gnu/store/x9qzb42hmzszg9y16m1gbz3vv54yyi00-gawk-5.0.1/include:/gnu/store/wsxnp4k7mp7b705kxp94j7hs8as5fmsl-make-4.3/include:/gnu/store/1iwrsjwmhcdifc8i3v7qdr59k6gq4z24-binutils-2.34/include:/gnu/store/z8954h4nvgxwcyy2in8c1l11g199m2yb-gcc-7.5.0/include:/gnu/store/llkv94k15spryi6zf0gjm0fp7m8k3i8g-glibc-2.31/include:/gnu/store/36c64cqp24i8i8p9m5402ig0pclmcvld-gmp-6.2.0/include:/gnu/store/f8dk4p7wlggm2p6jjgpbvri31zacnp5i-libgc-8.0.4/include:/gnu/store/il1kyhiljxf66lqy4b7sh03y7yl3i1a8-libltdl-2.4.6/include:/gnu/store/kykplfxdjnf44pxn154d8sg30vrpdp2c-libunistring-0.9.10/include:/gnu/store/72z9rxrrmfw1xx9gf27jm2s8h5h0fkh0-linux-libre-headers-5.4.20/include'
environment variable `CPLUS_INCLUDE_PATH' set to `/gnu/store/fn4rd9nwwfgkk47i82qjmsqpvp1qk8v4-guile-3.0.2/include:/gnu/store/5r2m9qryzzzq71vdhlph4bc5d186p342-libgcrypt-1.8.5/include:/gnu/store/k3n5jh5579g2b17qmd2w89z2fy45pmr3-bzip2-1.0.8/include:/gnu/store/k8ksi57ghm301zr0v7aq2vl2fa8hxfqi-xz-5.2.4/include:/gnu/store/5ckix15mw8r509g68fbm7rla51lmd2zq-file-5.38/include:/gnu/store/x9qzb42hmzszg9y16m1gbz3vv54yyi00-gawk-5.0.1/include:/gnu/store/wsxnp4k7mp7b705kxp94j7hs8as5fmsl-make-4.3/include:/gnu/store/1iwrsjwmhcdifc8i3v7qdr59k6gq4z24-binutils-2.34/include:/gnu/store/z8954h4nvgxwcyy2in8c1l11g199m2yb-gcc-7.5.0/include/c++:/gnu/store/z8954h4nvgxwcyy2in8c1l11g199m2yb-gcc-7.5.0/include:/gnu/store/llkv94k15spryi6zf0gjm0fp7m8k3i8g-glibc-2.31/include:/gnu/store/36c64cqp24i8i8p9m5402ig0pclmcvld-gmp-6.2.0/include:/gnu/store/f8dk4p7wlggm2p6jjgpbvri31zacnp5i-libgc-8.0.4/include:/gnu/store/il1kyhiljxf66lqy4b7sh03y7yl3i1a8-libltdl-2.4.6/include:/gnu/store/kykplfxdjnf44pxn154d8sg30vrpdp2c-libunistring-0.9.10/include:/gnu/store/j5g485vkgfakgr5rjnq8a10gaxcsvq1i-libgpg-error-1.37/include:/gnu/store/72z9rxrrmfw1xx9gf27jm2s8h5h0fkh0-linux-libre-headers-5.4.20/include'
environment variable `CPLUS_INCLUDE_PATH' set to `/gnu/store/fn4rd9nwwfgkk47i82qjmsqpvp1qk8v4-guile-3.0.2/include:/gnu/store/ggi94fcdb97561a499wx8y2lxc41cmrm-lzlib-1.12/include:/gnu/store/k3n5jh5579g2b17qmd2w89z2fy45pmr3-bzip2-1.0.8/include:/gnu/store/k8ksi57ghm301zr0v7aq2vl2fa8hxfqi-xz-5.2.4/include:/gnu/store/5ckix15mw8r509g68fbm7rla51lmd2zq-file-5.38/include:/gnu/store/x9qzb42hmzszg9y16m1gbz3vv54yyi00-gawk-5.0.1/include:/gnu/store/wsxnp4k7mp7b705kxp94j7hs8as5fmsl-make-4.3/include:/gnu/store/1iwrsjwmhcdifc8i3v7qdr59k6gq4z24-binutils-2.34/include:/gnu/store/z8954h4nvgxwcyy2in8c1l11g199m2yb-gcc-7.5.0/include/c++:/gnu/store/z8954h4nvgxwcyy2in8c1l11g199m2yb-gcc-7.5.0/include:/gnu/store/llkv94k15spryi6zf0gjm0fp7m8k3i8g-glibc-2.31/include:/gnu/store/36c64cqp24i8i8p9m5402ig0pclmcvld-gmp-6.2.0/include:/gnu/store/f8dk4p7wlggm2p6jjgpbvri31zacnp5i-libgc-8.0.4/include:/gnu/store/il1kyhiljxf66lqy4b7sh03y7yl3i1a8-libltdl-2.4.6/include:/gnu/store/kykplfxdjnf44pxn154d8sg30vrpdp2c-libunistring-0.9.10/include:/gnu/store/72z9rxrrmfw1xx9gf27jm2s8h5h0fkh0-linux-libre-headers-5.4.20/include'
environment variable `LIBRARY_PATH' set to `/gnu/store/cd9vnmj0z9068xrgvssavnkfc8a9svly-texinfo-6.7/lib:/gnu/store/fn4rd9nwwfgkk47i82qjmsqpvp1qk8v4-guile-3.0.2/lib:/gnu/store/5r2m9qryzzzq71vdhlph4bc5d186p342-libgcrypt-1.8.5/lib:/gnu/store/k3n5jh5579g2b17qmd2w89z2fy45pmr3-bzip2-1.0.8/lib:/gnu/store/k8ksi57ghm301zr0v7aq2vl2fa8hxfqi-xz-5.2.4/lib:/gnu/store/5ckix15mw8r509g68fbm7rla51lmd2zq-file-5.38/lib:/gnu/store/x9qzb42hmzszg9y16m1gbz3vv54yyi00-gawk-5.0.1/lib:/gnu/store/1iwrsjwmhcdifc8i3v7qdr59k6gq4z24-binutils-2.34/lib:/gnu/store/llkv94k15spryi6zf0gjm0fp7m8k3i8g-glibc-2.31/lib:/gnu/store/m4l52mw8m0amgy4j129z5j0syryb7pkg-glibc-2.31-static/lib:/gnu/store/vispxhcwmvasm225pm373jhfn21q1sa1-glibc-utf8-locales-2.31/lib:/gnu/store/36c64cqp24i8i8p9m5402ig0pclmcvld-gmp-6.2.0/lib:/gnu/store/f8dk4p7wlggm2p6jjgpbvri31zacnp5i-libgc-8.0.4/lib:/gnu/store/il1kyhiljxf66lqy4b7sh03y7yl3i1a8-libltdl-2.4.6/lib:/gnu/store/kykplfxdjnf44pxn154d8sg30vrpdp2c-libunistring-0.9.10/lib:/gnu/store/j5g485vkgfakgr5rjnq8a10gaxcsvq1i-libgpg-error-1.37/lib'
environment variable `GUIX_LOCPATH' set to `/gnu/store/vispxhcwmvasm225pm373jhfn21q1sa1-glibc-utf8-locales-2.31/lib/locale'
environment variable `LIBRARY_PATH' set to `/gnu/store/fn4rd9nwwfgkk47i82qjmsqpvp1qk8v4-guile-3.0.2/lib:/gnu/store/ggi94fcdb97561a499wx8y2lxc41cmrm-lzlib-1.12/lib:/gnu/store/k3n5jh5579g2b17qmd2w89z2fy45pmr3-bzip2-1.0.8/lib:/gnu/store/k8ksi57ghm301zr0v7aq2vl2fa8hxfqi-xz-5.2.4/lib:/gnu/store/5ckix15mw8r509g68fbm7rla51lmd2zq-file-5.38/lib:/gnu/store/x9qzb42hmzszg9y16m1gbz3vv54yyi00-gawk-5.0.1/lib:/gnu/store/1iwrsjwmhcdifc8i3v7qdr59k6gq4z24-binutils-2.34/lib:/gnu/store/llkv94k15spryi6zf0gjm0fp7m8k3i8g-glibc-2.31/lib:/gnu/store/m4l52mw8m0amgy4j129z5j0syryb7pkg-glibc-2.31-static/lib:/gnu/store/vispxhcwmvasm225pm373jhfn21q1sa1-glibc-utf8-locales-2.31/lib:/gnu/store/36c64cqp24i8i8p9m5402ig0pclmcvld-gmp-6.2.0/lib:/gnu/store/f8dk4p7wlggm2p6jjgpbvri31zacnp5i-libgc-8.0.4/lib:/gnu/store/il1kyhiljxf66lqy4b7sh03y7yl3i1a8-libltdl-2.4.6/lib:/gnu/store/kykplfxdjnf44pxn154d8sg30vrpdp2c-libunistring-0.9.10/lib'
environment variable `GUIX_LOCPATH' set to `/gnu/store/vispxhcwmvasm225pm373jhfn21q1sa1-glibc-utf8-locales-2.31/lib/locale'
phase `set-paths' succeeded after 0.3 seconds
phase `set-paths' succeeded after 0.3 seconds
starting phase `install-locale'
starting phase `install-locale'
using 'en_US.utf8' locale for category "LC_ALL"
phase `install-locale' succeeded after 0.0 seconds
using 'en_US.utf8' locale for category "LC_ALL"
phase `install-locale' succeeded after 0.0 seconds
starting phase `unpack'
starting phase `unpack'
`/gnu/store/xd6nc3fj99mdhxg6ii4spky971xniwp2-guile-gcrypt-0.3.0-checkout/AUTHORS' -> `./AUTHORS'
`/gnu/store/xd6nc3fj99mdhxg6ii4spky971xniwp2-guile-gcrypt-0.3.0-checkout/guile-gcrypt.texi' -> `./guile-gcrypt.texi'
`/gnu/store/xd6nc3fj99mdhxg6ii4spky971xniwp2-guile-gcrypt-0.3.0-checkout/ChangeLog' -> `./ChangeLog'
`/gnu/store/xd6nc3fj99mdhxg6ii4spky971xniwp2-guile-gcrypt-0.3.0-checkout/configure.ac' -> `./configure.ac'
`/gnu/store/xd6nc3fj99mdhxg6ii4spky971xniwp2-guile-gcrypt-0.3.0-checkout/README' -> `./README'
`/gnu/store/xd6nc3fj99mdhxg6ii4spky971xniwp2-guile-gcrypt-0.3.0-checkout/pre-inst-env.in' -> `./pre-inst-env.in'
`/gnu/store/xd6nc3fj99mdhxg6ii4spky971xniwp2-guile-gcrypt-0.3.0-checkout/bootstrap.sh' -> `./bootstrap.sh'
`/gnu/store/xd6nc3fj99mdhxg6ii4spky971xniwp2-guile-gcrypt-0.3.0-checkout/fdl-1.3.texi' -> `./fdl-1.3.texi'
`/gnu/store/xd6nc3fj99mdhxg6ii4spky971xniwp2-guile-gcrypt-0.3.0-checkout/guix.scm' -> `./guix.scm'
`/gnu/store/xd6nc3fj99mdhxg6ii4spky971xniwp2-guile-gcrypt-0.3.0-checkout/COPYING' -> `./COPYING'
`/gnu/store/xd6nc3fj99mdhxg6ii4spky971xniwp2-guile-gcrypt-0.3.0-checkout/Makefile.am' -> `./Makefile.am'
`/gnu/store/xd6nc3fj99mdhxg6ii4spky971xniwp2-guile-gcrypt-0.3.0-checkout/.gitignore' -> `./.gitignore'
`/gnu/store/xd6nc3fj99mdhxg6ii4spky971xniwp2-guile-gcrypt-0.3.0-checkout/NEWS' -> `./NEWS'
`/gnu/store/xd6nc3fj99mdhxg6ii4spky971xniwp2-guile-gcrypt-0.3.0-checkout/m4/guix.m4' -> `./m4/guix.m4'
`/gnu/store/xd6nc3fj99mdhxg6ii4spky971xniwp2-guile-gcrypt-0.3.0-checkout/gcrypt/pk-crypto.scm' -> `./gcrypt/pk-crypto.scm'
`/gnu/store/xd6nc3fj99mdhxg6ii4spky971xniwp2-guile-gcrypt-0.3.0-checkout/gcrypt/common.scm' -> `./gcrypt/common.scm'
`/gnu/store/xd6nc3fj99mdhxg6ii4spky971xniwp2-guile-gcrypt-0.3.0-checkout/gcrypt/base16.scm' -> `./gcrypt/base16.scm'
`/gnu/store/xd6nc3fj99mdhxg6ii4spky971xniwp2-guile-gcrypt-0.3.0-checkout/gcrypt/base64.scm' -> `./gcrypt/base64.scm'
`/gnu/store/xd6nc3fj99mdhxg6ii4spky971xniwp2-guile-gcrypt-0.3.0-checkout/gcrypt/internal.scm' -> `./gcrypt/internal.scm'
`/gnu/store/xd6nc3fj99mdhxg6ii4spky971xniwp2-guile-gcrypt-0.3.0-checkout/gcrypt/hash.scm' -> `./gcrypt/hash.scm'
`/gnu/store/xd6nc3fj99mdhxg6ii4spky971xniwp2-guile-gcrypt-0.3.0-checkout/gcrypt/hmac.scm' -> `./gcrypt/hmac.scm'
`/gnu/store/xd6nc3fj99mdhxg6ii4spky971xniwp2-guile-gcrypt-0.3.0-checkout/gcrypt/random.scm' -> `./gcrypt/random.scm'
`/gnu/store/xd6nc3fj99mdhxg6ii4spky971xniwp2-guile-gcrypt-0.3.0-checkout/gcrypt/package-config.scm.in' -> `./gcrypt/package-config.scm.in'
`/gnu/store/xd6nc3fj99mdhxg6ii4spky971xniwp2-guile-gcrypt-0.3.0-checkout/gcrypt/utils.scm' -> `./gcrypt/utils.scm'
`/gnu/store/xd6nc3fj99mdhxg6ii4spky971xniwp2-guile-gcrypt-0.3.0-checkout/gcrypt/mac.scm' -> `./gcrypt/mac.scm'
`/gnu/store/xd6nc3fj99mdhxg6ii4spky971xniwp2-guile-gcrypt-0.3.0-checkout/build-aux/test-driver.scm' -> `./build-aux/test-driver.scm'
`/gnu/store/xd6nc3fj99mdhxg6ii4spky971xniwp2-guile-gcrypt-0.3.0-checkout/tests/pk-crypto.scm' -> `./tests/pk-crypto.scm'
`/gnu/store/xd6nc3fj99mdhxg6ii4spky971xniwp2-guile-gcrypt-0.3.0-checkout/tests/base16.scm' -> `./tests/base16.scm'
`/gnu/store/xd6nc3fj99mdhxg6ii4spky971xniwp2-guile-gcrypt-0.3.0-checkout/tests/base64.scm' -> `./tests/base64.scm'
`/gnu/store/xd6nc3fj99mdhxg6ii4spky971xniwp2-guile-gcrypt-0.3.0-checkout/tests/hash.scm' -> `./tests/hash.scm'
`/gnu/store/xd6nc3fj99mdhxg6ii4spky971xniwp2-guile-gcrypt-0.3.0-checkout/tests/hmac.scm' -> `./tests/hmac.scm'
`/gnu/store/xd6nc3fj99mdhxg6ii4spky971xniwp2-guile-gcrypt-0.3.0-checkout/tests/mac.scm' -> `./tests/mac.scm'
phase `unpack' succeeded after 0.1 seconds
starting phase `bootstrap'
running './bootstrap.sh'
guile-lzlib/
guile-lzlib/.gitignore
guile-lzlib/AUTHORS
guile-lzlib/COPYING
guile-lzlib/ChangeLog
guile-lzlib/HACKING
guile-lzlib/Makefile.am
guile-lzlib/NEWS
guile-lzlib/README
guile-lzlib/README.org
guile-lzlib/build-aux/
guile-lzlib/build-aux/test-driver.scm
guile-lzlib/configure.ac
guile-lzlib/guix.scm
guile-lzlib/hall.scm
guile-lzlib/lzlib.scm
guile-lzlib/lzlib/
guile-lzlib/lzlib/config.scm
guile-lzlib/lzlib/config.scm.in
guile-lzlib/pre-inst-env.in
guile-lzlib/tests/
guile-lzlib/tests/lzlib.scm
patch-shebang: ./bootstrap.sh: changing `/bin/sh' to `/gnu/store/7zp9ifpgm3zj481nk6jg1im13g4mza2g-bash-minimal-5.0.16/bin/sh'
phase `unpack' succeeded after 0.1 seconds
starting phase `bootstrap'
autoreconf: Entering directory `.'
autoreconf: configure.ac: not using Gettext
autoreconf: Entering directory `.'
autoreconf: configure.ac: not using Gettext
autoreconf: running: aclocal --force 
autoreconf: running: aclocal --force 
autoreconf: configure.ac: tracing
autoreconf: configure.ac: tracing
autoreconf: configure.ac: not using Libtool
autoreconf: running: /gnu/store/b3ijxswrcsl3l4406aawbmby4nc0lc0b-autoconf-2.69/bin/autoconf --force
autoreconf: configure.ac: not using Libtool
autoreconf: running: /gnu/store/b3ijxswrcsl3l4406aawbmby4nc0lc0b-autoconf-2.69/bin/autoconf --force
autoreconf: configure.ac: not using Autoheader
autoreconf: running: automake --add-missing --copy --force-missing
autoreconf: configure.ac: not using Autoheader
autoreconf: running: automake --add-missing --copy --force-missing
configure.ac:51: installing 'build-aux/compile'
configure.ac:8: installing 'build-aux/install-sh'
configure.ac:8: installing 'build-aux/missing'
Makefile.am: installing './INSTALL'
autoreconf: Leaving directory `.'
phase `bootstrap' succeeded after 25.1 seconds
starting phase `patch-usr-bin-file'
phase `patch-usr-bin-file' succeeded after 0.2 seconds
starting phase `patch-source-shebangs'
patch-shebang: ./build-aux/compile: changing `/bin/sh' to `/gnu/store/7zp9ifpgm3zj481nk6jg1im13g4mza2g-bash-minimal-5.0.16/bin/sh'
patch-shebang: ./build-aux/install-sh: changing `/bin/sh' to `/gnu/store/7zp9ifpgm3zj481nk6jg1im13g4mza2g-bash-minimal-5.0.16/bin/sh'
patch-shebang: ./build-aux/missing: changing `/bin/sh' to `/gnu/store/7zp9ifpgm3zj481nk6jg1im13g4mza2g-bash-minimal-5.0.16/bin/sh'
patch-shebang: ./configure: changing `/bin/sh' to `/gnu/store/7zp9ifpgm3zj481nk6jg1im13g4mza2g-bash-minimal-5.0.16/bin/sh'
phase `patch-source-shebangs' succeeded after 0.0 seconds
starting phase `configure'
source directory: "/tmp/guix-build-guile-lzlib-0.0.2.drv-0/guile-lzlib" (relative from build: ".")
build directory: "/tmp/guix-build-guile-lzlib-0.0.2.drv-0/guile-lzlib"
configure flags: ("CONFIG_SHELL=/gnu/store/7zp9ifpgm3zj481nk6jg1im13g4mza2g-bash-minimal-5.0.16/bin/bash" "SHELL=/gnu/store/7zp9ifpgm3zj481nk6jg1im13g4mza2g-bash-minimal-5.0.16/bin/bash" "--prefix=/gnu/store/1cfbihr300czn4vhvycxsw1a2fx2x3yl-guile-lzlib-0.0.2" "--enable-fast-install" "--build=arm-unknown-linux-gnueabihf")
configure.ac:7: installing 'build-aux/install-sh'
configure.ac:7: installing 'build-aux/missing'
Makefile.am: installing './INSTALL'
Makefile.am:95: installing 'build-aux/mdate-sh'
Makefile.am:95: installing 'build-aux/texinfo.tex'
autoreconf: Leaving directory `.'
phase `bootstrap' succeeded after 26.9 seconds
starting phase `patch-usr-bin-file'
phase `patch-usr-bin-file' succeeded after 0.2 seconds
starting phase `patch-source-shebangs'
patch-shebang: ./build-aux/install-sh: changing `/bin/sh' to `/gnu/store/7zp9ifpgm3zj481nk6jg1im13g4mza2g-bash-minimal-5.0.16/bin/sh'
patch-shebang: ./build-aux/mdate-sh: changing `/bin/sh' to `/gnu/store/7zp9ifpgm3zj481nk6jg1im13g4mza2g-bash-minimal-5.0.16/bin/sh'
patch-shebang: ./build-aux/missing: changing `/bin/sh' to `/gnu/store/7zp9ifpgm3zj481nk6jg1im13g4mza2g-bash-minimal-5.0.16/bin/sh'
patch-shebang: ./configure: changing `/bin/sh' to `/gnu/store/7zp9ifpgm3zj481nk6jg1im13g4mza2g-bash-minimal-5.0.16/bin/sh'
patch-shebang: ./pre-inst-env.in: changing `/bin/sh' to `/gnu/store/7zp9ifpgm3zj481nk6jg1im13g4mza2g-bash-minimal-5.0.16/bin/sh'
phase `patch-source-shebangs' succeeded after 0.0 seconds
starting phase `configure'
source directory: "/tmp/guix-build-guile-gcrypt-0.3.0.drv-0/source" (relative from build: ".")
build directory: "/tmp/guix-build-guile-gcrypt-0.3.0.drv-0/source"
configure flags: ("CONFIG_SHELL=/gnu/store/7zp9ifpgm3zj481nk6jg1im13g4mza2g-bash-minimal-5.0.16/bin/bash" "SHELL=/gnu/store/7zp9ifpgm3zj481nk6jg1im13g4mza2g-bash-minimal-5.0.16/bin/bash" "--prefix=/gnu/store/09fv2im6aaawh0xnv4fq9raj637rv7sj-guile-gcrypt-0.3.0" "--enable-fast-install" "--build=arm-unknown-linux-gnueabihf")
configure: WARNING: unrecognized options: --enable-fast-install
checking for a BSD-compatible install... /gnu/store/wy177cwa387g9kaf3ss716d4fhzb21wx-coreutils-8.32/bin/install -c
checking whether build environment is sane... yes
configure: WARNING: unrecognized options: --enable-fast-install
checking for a thread-safe mkdir -p... /gnu/store/wy177cwa387g9kaf3ss716d4fhzb21wx-coreutils-8.32/bin/mkdir -p
checking for gawk... gawk
checking whether make sets $(MAKE)... no
checking whether make supports nested variables... yes
checking whether make supports nested variables... (cached) yes
checking for pkg-config... /gnu/store/3rs3zyc4886bdp0x4dmfyhpw18w0n9km-pkg-config-0.29.2/bin/pkg-config
checking pkg-config is at least version 0.9.0... yes
configure: checking for guile 3.0
configure: found guile 3.0
checking for guile-3.0... no
checking for a BSD-compatible install... checking for guile3.0... no
checking for guile-3... no
checking for guile3... no
checking for guile... /gnu/store/fn4rd9nwwfgkk47i82qjmsqpvp1qk8v4-guile-3.0.2/bin/guile
/gnu/store/wy177cwa387g9kaf3ss716d4fhzb21wx-coreutils-8.32/bin/install -c
checking whether build environment is sane... yes
checking for a thread-safe mkdir -p... /gnu/store/wy177cwa387g9kaf3ss716d4fhzb21wx-coreutils-8.32/bin/mkdir -p
checking for gawk... gawk
checking whether make sets $(MAKE)... no
checking whether make supports nested variables... yes
checking for Guile version >= 3.0... checking whether make supports nested variables... (cached) yes
checking for pkg-config... /gnu/store/3rs3zyc4886bdp0x4dmfyhpw18w0n9km-pkg-config-0.29.2/bin/pkg-config
checking pkg-config is at least version 0.9.0... yes
configure: checking for guile 3.0
3.0.2
checking for guild... /gnu/store/fn4rd9nwwfgkk47i82qjmsqpvp1qk8v4-guile-3.0.2/bin/guild
checking for guile-config... /gnu/store/fn4rd9nwwfgkk47i82qjmsqpvp1qk8v4-guile-3.0.2/bin/guile-config
checking for Guile site directory... configure: found guile 3.0
/gnu/store/fn4rd9nwwfgkk47i82qjmsqpvp1qk8v4-guile-3.0.2/share/guile/site/3.0
checking for Guile site-ccache directory using pkgconfig... checking for guile-3.0... no
checking for guile3.0... no
checking for guile-3... no
checking for guile3... no
checking for guile... /gnu/store/fn4rd9nwwfgkk47i82qjmsqpvp1qk8v4-guile-3.0.2/bin/guile
/gnu/store/fn4rd9nwwfgkk47i82qjmsqpvp1qk8v4-guile-3.0.2/lib/guile/3.0/site-ccache
checking for Guile extensions directory... /gnu/store/fn4rd9nwwfgkk47i82qjmsqpvp1qk8v4-guile-3.0.2/lib/guile/3.0/extensions
checking whether make supports the include directive... yes (GNU style)
checking for gcc... gcc
checking whether the C compiler works... checking for Guile version >= 3.0... 3.0.2
checking for guild... /gnu/store/fn4rd9nwwfgkk47i82qjmsqpvp1qk8v4-guile-3.0.2/bin/guild
checking for guile-config... /gnu/store/fn4rd9nwwfgkk47i82qjmsqpvp1qk8v4-guile-3.0.2/bin/guile-config
checking for libgcrypt-config... /gnu/store/5r2m9qryzzzq71vdhlph4bc5d186p342-libgcrypt-1.8.5/bin/libgcrypt-config
checking libgcrypt's library directory... /gnu/store/5r2m9qryzzzq71vdhlph4bc5d186p342-libgcrypt-1.8.5/lib
checking for libgcrypt shared library name... /gnu/store/5r2m9qryzzzq71vdhlph4bc5d186p342-libgcrypt-1.8.5/lib/libgcrypt
checking whether /gnu/store/5r2m9qryzzzq71vdhlph4bc5d186p342-libgcrypt-1.8.5/lib/libgcrypt can be dynamically loaded... yes
yes
checking for C compiler default output file name... a.out
checking for suffix of executables... checking that generated files are newer than configure... done
configure: creating ./config.status

checking whether we are cross compiling... no
checking for suffix of object files... config.status: creating Makefile
o
checking whether we are using the GNU C compiler... config.status: creating gcrypt/package-config.scm
yes
checking whether gcc accepts -g... config.status: creating pre-inst-env
configure: WARNING: unrecognized options: --enable-fast-install
yes
checking for gcc option to accept ISO C89... phase `configure' succeeded after 12.7 seconds
starting phase `patch-generated-file-shebangs'
phase `patch-generated-file-shebangs' succeeded after 0.1 seconds
starting phase `build'
none needed
checking whether gcc understands -c and -o together... Updating ./version.texi
  MAKEINFO guile-gcrypt.info
yes
checking dependency style of gcc... none
checking lzlib's file name... 
checking that generated files are newer than configure... done
configure: creating ./config.status
  GEN      gcrypt/base16.go
config.status: creating Makefile
config.status: creating lzlib/config.scm
config.status: creating pre-inst-env
config.status: executing depfiles commands
configure: WARNING: unrecognized options: --enable-fast-install
wrote `gcrypt/base16.go'
;;; note: auto-compilation is enabled, set GUILE_AUTO_COMPILE=0
;;;       or pass the --no-auto-compile argument to disable.
;;; compiling /gnu/store/fn4rd9nwwfgkk47i82qjmsqpvp1qk8v4-guile-3.0.2/bin/guild
;;; WARNING: compilation of /gnu/store/fn4rd9nwwfgkk47i82qjmsqpvp1qk8v4-guile-3.0.2/bin/guild failed:
;;; failed to create path for auto-compiled file "/gnu/store/fn4rd9nwwfgkk47i82qjmsqpvp1qk8v4-guile-3.0.2/bin/guild"
  GEN      gcrypt/base64.go
phase `configure' succeeded after 24.9 seconds
starting phase `patch-generated-file-shebangs'
phase `patch-generated-file-shebangs' succeeded after 0.1 seconds
starting phase `build'
  GEN      lzlib.go
  GEN      lzlib/config.go
wrote `lzlib/config.go'
wrote `gcrypt/base64.go'
;;; note: auto-compilation is enabled, set GUILE_AUTO_COMPILE=0
;;;       or pass the --no-auto-compile argument to disable.
;;; compiling /gnu/store/fn4rd9nwwfgkk47i82qjmsqpvp1qk8v4-guile-3.0.2/bin/guild
;;; WARNING: compilation of /gnu/store/fn4rd9nwwfgkk47i82qjmsqpvp1qk8v4-guile-3.0.2/bin/guild failed:
;;; failed to create path for auto-compiled file "/gnu/store/fn4rd9nwwfgkk47i82qjmsqpvp1qk8v4-guile-3.0.2/bin/guild"
  GEN      gcrypt/common.go
wrote `lzlib.go'
phase `build' succeeded after 15.5 seconds
starting phase `check'
make  check-TESTS
make[1]: Entering directory '/tmp/guix-build-guile-lzlib-0.0.2.drv-0/guile-lzlib'
make[2]: Entering directory '/tmp/guix-build-guile-lzlib-0.0.2.drv-0/guile-lzlib'
wrote `gcrypt/common.go'
;;; note: auto-compilation is enabled, set GUILE_AUTO_COMPILE=0
;;;       or pass the --no-auto-compile argument to disable.
;;; compiling /gnu/store/fn4rd9nwwfgkk47i82qjmsqpvp1qk8v4-guile-3.0.2/bin/guild
;;; WARNING: compilation of /gnu/store/fn4rd9nwwfgkk47i82qjmsqpvp1qk8v4-guile-3.0.2/bin/guild failed:
;;; failed to create path for auto-compiled file "/gnu/store/fn4rd9nwwfgkk47i82qjmsqpvp1qk8v4-guile-3.0.2/bin/guild"
  GEN      gcrypt/hash.go
wrote `gcrypt/hash.go'
;;; note: auto-compilation is enabled, set GUILE_AUTO_COMPILE=0
;;;       or pass the --no-auto-compile argument to disable.
;;; compiling /gnu/store/fn4rd9nwwfgkk47i82qjmsqpvp1qk8v4-guile-3.0.2/bin/guild
;;; WARNING: compilation of /gnu/store/fn4rd9nwwfgkk47i82qjmsqpvp1qk8v4-guile-3.0.2/bin/guild failed:
;;; failed to create path for auto-compiled file "/gnu/store/fn4rd9nwwfgkk47i82qjmsqpvp1qk8v4-guile-3.0.2/bin/guild"
  GEN      gcrypt/hmac.go
wrote `gcrypt/hmac.go'
;;; note: auto-compilation is enabled, set GUILE_AUTO_COMPILE=0
;;;       or pass the --no-auto-compile argument to disable.
;;; compiling /gnu/store/fn4rd9nwwfgkk47i82qjmsqpvp1qk8v4-guile-3.0.2/bin/guild
;;; WARNING: compilation of /gnu/store/fn4rd9nwwfgkk47i82qjmsqpvp1qk8v4-guile-3.0.2/bin/guild failed:
;;; failed to create path for auto-compiled file "/gnu/store/fn4rd9nwwfgkk47i82qjmsqpvp1qk8v4-guile-3.0.2/bin/guild"
  GEN      gcrypt/internal.go
wrote `gcrypt/internal.go'
;;; note: auto-compilation is enabled, set GUILE_AUTO_COMPILE=0
;;;       or pass the --no-auto-compile argument to disable.
;;; compiling /gnu/store/fn4rd9nwwfgkk47i82qjmsqpvp1qk8v4-guile-3.0.2/bin/guild
;;; WARNING: compilation of /gnu/store/fn4rd9nwwfgkk47i82qjmsqpvp1qk8v4-guile-3.0.2/bin/guild failed:
;;; failed to create path for auto-compiled file "/gnu/store/fn4rd9nwwfgkk47i82qjmsqpvp1qk8v4-guile-3.0.2/bin/guild"
  GEN      gcrypt/mac.go
FAIL: tests/lzlib.scm
============================================================================
Testsuite summary for guile-lzlib 0.2
============================================================================
# TOTAL: 12
# PASS:  0
# SKIP:  0
# XFAIL: 0
# FAIL:  12
# XPASS: 0
# ERROR: 0
============================================================================
See ./test-suite.log
============================================================================
make[2]: *** [Makefile:720: test-suite.log] Error 1
make[2]: Leaving directory '/tmp/guix-build-guile-lzlib-0.0.2.drv-0/guile-lzlib'
make[1]: *** [Makefile:828: check-TESTS] Error 2
make[1]: Leaving directory '/tmp/guix-build-guile-lzlib-0.0.2.drv-0/guile-lzlib'
make: *** [Makefile:1033: check-am] Error 2

Test suite failed, dumping logs.

--- ./test-suite.log --------------------------------------------------------

=======================================
   guile-lzlib 0.2: ./test-suite.log
=======================================

# TOTAL: 12
# PASS:  0
# SKIP:  0
# XFAIL: 0
# FAIL:  12
# XPASS: 0
# ERROR: 0

.. contents:: :depth: 2

FAIL: tests/lzlib
=================

test-name: null bytevector
location: /tmp/guix-build-guile-lzlib-0.0.2.drv-0/guile-lzlib/tests/lzlib.scm:86
source:
+ (test-assert
+   "null bytevector"
+   (compress-and-decompress
+     (make-bytevector (+ (random 100000) (* 20 1024)))))

;;; ("Uncompressed bytes:" 71101)
random seed for tests: 1611728906
test-name: null bytevector
location: /tmp/guix-build-guile-lzlib-0.0.2.drv-0/guile-lzlib/tests/lzlib.scm:86
source:
+ (test-assert
+   "null bytevector"
+   (compress-and-decompress
+     (make-bytevector (+ (random 100000) (* 20 1024)))))

;;; ("Uncompressed bytes:" 71101)
actual-value: #f
actual-error:
+ (wrong-type-arg
+   #f
+   "Wrong type to apply: ~S"
+   (#f)
+   (#f))
result: FAIL

test-name: random bytevector
location: /tmp/guix-build-guile-lzlib-0.0.2.drv-0/guile-lzlib/tests/lzlib.scm:90
source:
+ (test-assert
+   "random bytevector"
+   (compress-and-decompress
+     (random-bytevector
+       (+ (random 100000) (* 20 1024)))))

;;; ("Uncompressed bytes:" 98099)
random seed for tests: 1611728906
test-name: null bytevector
location: /tmp/guix-build-guile-lzlib-0.0.2.drv-0/guile-lzlib/tests/lzlib.scm:86
source:
+ (test-assert
+   "null bytevector"
+   (compress-and-decompress
+     (make-bytevector (+ (random 100000) (* 20 1024)))))

;;; ("Uncompressed bytes:" 71101)
actual-value: #f
actual-error:
+ (wrong-type-arg
+   #f
+   "Wrong type to apply: ~S"
+   (#f)
+   (#f))
result: FAIL

test-name: random bytevector
location: /tmp/guix-build-guile-lzlib-0.0.2.drv-0/guile-lzlib/tests/lzlib.scm:90
source:
+ (test-assert
+   "random bytevector"
+   (compress-and-decompress
+     (random-bytevector
+       (+ (random 100000) (* 20 1024)))))

;;; ("Uncompressed bytes:" 98099)
actual-value: #f
actual-error:
+ (wrong-type-arg
+   #f
+   "Wrong type to apply: ~S"
+   (#f)
+   (#f))
result: FAIL

test-name: small bytevector
location: /tmp/guix-build-guile-lzlib-0.0.2.drv-0/guile-lzlib/tests/lzlib.scm:93
source:
+ (test-assert
+   "small bytevector"
+   (compress-and-decompress (random-bytevector 127)))

;;; ("Uncompressed bytes:" 127)
random seed for tests: 1611728906
test-name: null bytevector
location: /tmp/guix-build-guile-lzlib-0.0.2.drv-0/guile-lzlib/tests/lzlib.scm:86
source:
+ (test-assert
+   "null bytevector"
+   (compress-and-decompress
+     (make-bytevector (+ (random 100000) (* 20 1024)))))

;;; ("Uncompressed bytes:" 71101)
actual-value: #f
actual-error:
+ (wrong-type-arg
+   #f
+   "Wrong type to apply: ~S"
+   (#f)
+   (#f))
result: FAIL

test-name: random bytevector
location: /tmp/guix-build-guile-lzlib-0.0.2.drv-0/guile-lzlib/tests/lzlib.scm:90
source:
+ (test-assert
+   "random bytevector"
+   (compress-and-decompress
+     (random-bytevector
+       (+ (random 100000) (* 20 1024)))))

;;; ("Uncompressed bytes:" 98099)
actual-value: #f
actual-error:
+ (wrong-type-arg
+   #f
+   "Wrong type to apply: ~S"
+   (#f)
+   (#f))
result: FAIL

test-name: small bytevector
location: /tmp/guix-build-guile-lzlib-0.0.2.drv-0/guile-lzlib/tests/lzlib.scm:93
source:
+ (test-assert
+   "small bytevector"
+   (compress-and-decompress (random-bytevector 127)))

;;; ("Uncompressed bytes:" 127)
actual-value: #f
actual-error:
+ (wrong-type-arg
+   #f
+   "Wrong type to apply: ~S"
+   (#f)
+   (#f))
result: FAIL

test-name: 1 bytevector
location: /tmp/guix-build-guile-lzlib-0.0.2.drv-0/guile-lzlib/tests/lzlib.scm:96
source:
+ (test-assert
+   "1 bytevector"
+   (compress-and-decompress (random-bytevector 1)))

;;; ("Uncompressed bytes:" 1)
random seed for tests: 1611728906
test-name: null bytevector
location: /tmp/guix-build-guile-lzlib-0.0.2.drv-0/guile-lzlib/tests/lzlib.scm:86
source:
+ (test-assert
+   "null bytevector"
+   (compress-and-decompress
+     (make-bytevector (+ (random 100000) (* 20 1024)))))

;;; ("Uncompressed bytes:" 71101)
actual-value: #f
actual-error:
+ (wrong-type-arg
+   #f
+   "Wrong type to apply: ~S"
+   (#f)
+   (#f))
result: FAIL

test-name: random bytevector
location: /tmp/guix-build-guile-lzlib-0.0.2.drv-0/guile-lzlib/tests/lzlib.scm:90
source:
+ (test-assert
+   "random bytevector"
+   (compress-and-decompress
+     (random-bytevector
+       (+ (random 100000) (* 20 1024)))))

;;; ("Uncompressed bytes:" 98099)
actual-value: #f
actual-error:
+ (wrong-type-arg
+   #f
+   "Wrong type to apply: ~S"
+   (#f)
+   (#f))
result: FAIL

test-name: small bytevector
location: /tmp/guix-build-guile-lzlib-0.0.2.drv-0/guile-lzlib/tests/lzlib.scm:93
source:
+ (test-assert
+   "small bytevector"
+   (compress-and-decompress (random-bytevector 127)))

;;; ("Uncompressed bytes:" 127)
actual-value: #f
actual-error:
+ (wrong-type-arg
+   #f
+   "Wrong type to apply: ~S"
+   (#f)
+   (#f))
result: FAIL

test-name: 1 bytevector
location: /tmp/guix-build-guile-lzlib-0.0.2.drv-0/guile-lzlib/tests/lzlib.scm:96
source:
+ (test-assert
+   "1 bytevector"
+   (compress-and-decompress (random-bytevector 1)))

;;; ("Uncompressed bytes:" 1)
actual-value: #f
actual-error:
+ (wrong-type-arg
+   #f
+   "Wrong type to apply: ~S"
+   (#f)
+   (#f))
result: FAIL

test-name: Bytevector of size relative to Lzip internal buffers (2 * dictionary)
location: /tmp/guix-build-guile-lzlib-0.0.2.drv-0/guile-lzlib/tests/lzlib.scm:99
source:
+ (test-assert
+   "Bytevector of size relative to Lzip internal buffers (2 * dictionary)"
+   (compress-and-decompress
+     (random-bytevector
+       (* 2
+          (dictionary-size+match-length-limit
+            %default-compression-level)))))

;;; ("Uncompressed bytes:" 16777216)
random seed for tests: 1611728906
test-name: null bytevector
location: /tmp/guix-build-guile-lzlib-0.0.2.drv-0/guile-lzlib/tests/lzlib.scm:86
source:
+ (test-assert
+   "null bytevector"
+   (compress-and-decompress
+     (make-bytevector (+ (random 100000) (* 20 1024)))))

;;; ("Uncompressed bytes:" 71101)
actual-value: #f
actual-error:
+ (wrong-type-arg
+   #f
+   "Wrong type to apply: ~S"
+   (#f)
+   (#f))
result: FAIL

test-name: random bytevector
location: /tmp/guix-build-guile-lzlib-0.0.2.drv-0/guile-lzlib/tests/lzlib.scm:90
source:
+ (test-assert
+   "random bytevector"
+   (compress-and-decompress
+     (random-bytevector
+       (+ (random 100000) (* 20 1024)))))

;;; ("Uncompressed bytes:" 98099)
actual-value: #f
actual-error:
+ (wrong-type-arg
+   #f
+   "Wrong type to apply: ~S"
+   (#f)
+   (#f))
result: FAIL

test-name: small bytevector
location: /tmp/guix-build-guile-lzlib-0.0.2.drv-0/guile-lzlib/tests/lzlib.scm:93
source:
+ (test-assert
+   "small bytevector"
+   (compress-and-decompress (random-bytevector 127)))

;;; ("Uncompressed bytes:" 127)
actual-value: #f
actual-error:
+ (wrong-type-arg
+   #f
+   "Wrong type to apply: ~S"
+   (#f)
+   (#f))
result: FAIL

test-name: 1 bytevector
location: /tmp/guix-build-guile-lzlib-0.0.2.drv-0/guile-lzlib/tests/lzlib.scm:96
source:
+ (test-assert
+   "1 bytevector"
+   (compress-and-decompress (random-bytevector 1)))

;;; ("Uncompressed bytes:" 1)
actual-value: #f
actual-error:
+ (wrong-type-arg
+   #f
+   "Wrong type to apply: ~S"
+   (#f)
+   (#f))
result: FAIL

test-name: Bytevector of size relative to Lzip internal buffers (2 * dictionary)
location: /tmp/guix-build-guile-lzlib-0.0.2.drv-0/guile-lzlib/tests/lzlib.scm:99
source:
+ (test-assert
+   "Bytevector of size relative to Lzip internal buffers (2 * dictionary)"
+   (compress-and-decompress
+     (random-bytevector
+       (* 2
+          (dictionary-size+match-length-limit
+            %default-compression-level)))))

;;; ("Uncompressed bytes:" 16777216)
actual-value: #f
actual-error:
+ (wrong-type-arg
+   #f
+   "Wrong type to apply: ~S"
+   (#f)
+   (#f))
result: FAIL

test-name: Bytevector of size relative to Lzip internal buffers (64KiB)
location: /tmp/guix-build-guile-lzlib-0.0.2.drv-0/guile-lzlib/tests/lzlib.scm:104
source:
+ (test-assert
+   "Bytevector of size relative to Lzip internal buffers (64KiB)"
+   (compress-and-decompress
+     (random-bytevector (* 64 1024))))

;;; ("Uncompressed bytes:" 65536)
random seed for tests: 1611728906
test-name: null bytevector
location: /tmp/guix-build-guile-lzlib-0.0.2.drv-0/guile-lzlib/tests/lzlib.scm:86
source:
+ (test-assert
+   "null bytevector"
+   (compress-and-decompress
+     (make-bytevector (+ (random 100000) (* 20 1024)))))

;;; ("Uncompressed bytes:" 71101)
actual-value: #f
actual-error:
+ (wrong-type-arg
+   #f
+   "Wrong type to apply: ~S"
+   (#f)
+   (#f))
result: FAIL

test-name: random bytevector
location: /tmp/guix-build-guile-lzlib-0.0.2.drv-0/guile-lzlib/tests/lzlib.scm:90
source:
+ (test-assert
+   "random bytevector"
+   (compress-and-decompress
+     (random-bytevector
+       (+ (random 100000) (* 20 1024)))))

;;; ("Uncompressed bytes:" 98099)
actual-value: #f
actual-error:
+ (wrong-type-arg
+   #f
+   "Wrong type to apply: ~S"
+   (#f)
+   (#f))
result: FAIL

test-name: small bytevector
location: /tmp/guix-build-guile-lzlib-0.0.2.drv-0/guile-lzlib/tests/lzlib.scm:93
source:
+ (test-assert
+   "small bytevector"
+   (compress-and-decompress (random-bytevector 127)))

;;; ("Uncompressed bytes:" 127)
actual-value: #f
actual-error:
+ (wrong-type-arg
+   #f
+   "Wrong type to apply: ~S"
+   (#f)
+   (#f))
result: FAIL

test-name: 1 bytevector
location: /tmp/guix-build-guile-lzlib-0.0.2.drv-0/guile-lzlib/tests/lzlib.scm:96
source:
+ (test-assert
+   "1 bytevector"
+   (compress-and-decompress (random-bytevector 1)))

;;; ("Uncompressed bytes:" 1)
actual-value: #f
actual-error:
+ (wrong-type-arg
+   #f
+   "Wrong type to apply: ~S"
+   (#f)
+   (#f))
result: FAIL

test-name: Bytevector of size relative to Lzip internal buffers (2 * dictionary)
location: /tmp/guix-build-guile-lzlib-0.0.2.drv-0/guile-lzlib/tests/lzlib.scm:99
source:
+ (test-assert
+   "Bytevector of size relative to Lzip internal buffers (2 * dictionary)"
+   (compress-and-decompress
+     (random-bytevector
+       (* 2
+          (dictionary-size+match-length-limit
+            %default-compression-level)))))

;;; ("Uncompressed bytes:" 16777216)
actual-value: #f
actual-error:
+ (wrong-type-arg
+   #f
+   "Wrong type to apply: ~S"
+   (#f)
+   (#f))
result: FAIL

test-name: Bytevector of size relative to Lzip internal buffers (64KiB)
location: /tmp/guix-build-guile-lzlib-0.0.2.drv-0/guile-lzlib/tests/lzlib.scm:104
source:
+ (test-assert
+   "Bytevector of size relative to Lzip internal buffers (64KiB)"
+   (compress-and-decompress
+     (random-bytevector (* 64 1024))))

;;; ("Uncompressed bytes:" 65536)
actual-value: #f
actual-error:
+ (wrong-type-arg
+   #f
+   "Wrong type to apply: ~S"
+   (#f)
+   (#f))
result: FAIL

test-name: Bytevector of size relative to Lzip internal buffers (64KiB-1)
location: /tmp/guix-build-guile-lzlib-0.0.2.drv-0/guile-lzlib/tests/lzlib.scm:107
source:
+ (test-assert
+   "Bytevector of size relative to Lzip internal buffers (64KiB-1)"
+   (compress-and-decompress
+     (random-bytevector (#{1-}# (* 64 1024)))))

;;; ("Uncompressed bytes:" 65535)
random seed for tests: 1611728906
test-name: null bytevector
location: /tmp/guix-build-guile-lzlib-0.0.2.drv-0/guile-lzlib/tests/lzlib.scm:86
source:
+ (test-assert
+   "null bytevector"
+   (compress-and-decompress
+     (make-bytevector (+ (random 100000) (* 20 1024)))))

;;; ("Uncompressed bytes:" 71101)
actual-value: #f
actual-error:
+ (wrong-type-arg
+   #f
+   "Wrong type to apply: ~S"
+   (#f)
+   (#f))
result: FAIL

test-name: random bytevector
location: /tmp/guix-build-guile-lzlib-0.0.2.drv-0/guile-lzlib/tests/lzlib.scm:90
source:
+ (test-assert
+   "random bytevector"
+   (compress-and-decompress
+     (random-bytevector
+       (+ (random 100000) (* 20 1024)))))

;;; ("Uncompressed bytes:" 98099)
actual-value: #f
actual-error:
+ (wrong-type-arg
+   #f
+   "Wrong type to apply: ~S"
+   (#f)
+   (#f))
result: FAIL

test-name: small bytevector
location: /tmp/guix-build-guile-lzlib-0.0.2.drv-0/guile-lzlib/tests/lzlib.scm:93
source:
+ (test-assert
+   "small bytevector"
+   (compress-and-decompress (random-bytevector 127)))

;;; ("Uncompressed bytes:" 127)
actual-value: #f
actual-error:
+ (wrong-type-arg
+   #f
+   "Wrong type to apply: ~S"
+   (#f)
+   (#f))
result: FAIL

test-name: 1 bytevector
location: /tmp/guix-build-guile-lzlib-0.0.2.drv-0/guile-lzlib/tests/lzlib.scm:96
source:
+ (test-assert
+   "1 bytevector"
+   (compress-and-decompress (random-bytevector 1)))

;;; ("Uncompressed bytes:" 1)
actual-value: #f
actual-error:
+ (wrong-type-arg
+   #f
+   "Wrong type to apply: ~S"
+   (#f)
+   (#f))
result: FAIL

test-name: Bytevector of size relative to Lzip internal buffers (2 * dictionary)
location: /tmp/guix-build-guile-lzlib-0.0.2.drv-0/guile-lzlib/tests/lzlib.scm:99
source:
+ (test-assert
+   "Bytevector of size relative to Lzip internal buffers (2 * dictionary)"
+   (compress-and-decompress
+     (random-bytevector
+       (* 2
+          (dictionary-size+match-length-limit
+            %default-compression-level)))))

;;; ("Uncompressed bytes:" 16777216)
actual-value: #f
actual-error:
+ (wrong-type-arg
+   #f
+   "Wrong type to apply: ~S"
+   (#f)
+   (#f))
result: FAIL

test-name: Bytevector of size relative to Lzip internal buffers (64KiB)
location: /tmp/guix-build-guile-lzlib-0.0.2.drv-0/guile-lzlib/tests/lzlib.scm:104
source:
+ (test-assert
+   "Bytevector of size relative to Lzip internal buffers (64KiB)"
+   (compress-and-decompress
+     (random-bytevector (* 64 1024))))

;;; ("Uncompressed bytes:" 65536)
actual-value: #f
actual-error:
+ (wrong-type-arg
+   #f
+   "Wrong type to apply: ~S"
+   (#f)
+   (#f))
result: FAIL

test-name: Bytevector of size relative to Lzip internal buffers (64KiB-1)
location: /tmp/guix-build-guile-lzlib-0.0.2.drv-0/guile-lzlib/tests/lzlib.scm:107
source:
+ (test-assert
+   "Bytevector of size relative to Lzip internal buffers (64KiB-1)"
+   (compress-and-decompress
+     (random-bytevector (#{1-}# (* 64 1024)))))

;;; ("Uncompressed bytes:" 65535)
actual-value: #f
actual-error:
+ (wrong-type-arg
+   #f
+   "Wrong type to apply: ~S"
+   (#f)
+   (#f))
result: FAIL

test-name: Bytevector of size relative to Lzip internal buffers (64KiB+1)
location: /tmp/guix-build-guile-lzlib-0.0.2.drv-0/guile-lzlib/tests/lzlib.scm:110
source:
+ (test-assert
+   "Bytevector of size relative to Lzip internal buffers (64KiB+1)"
+   (compress-and-decompress
+     (random-bytevector (#{1+}# (* 64 1024)))))

;;; ("Uncompressed bytes:" 65537)
random seed for tests: 1611728906
test-name: null bytevector
location: /tmp/guix-build-guile-lzlib-0.0.2.drv-0/guile-lzlib/tests/lzlib.scm:86
source:
+ (test-assert
+   "null bytevector"
+   (compress-and-decompress
+     (make-bytevector (+ (random 100000) (* 20 1024)))))

;;; ("Uncompressed bytes:" 71101)
actual-value: #f
actual-error:
+ (wrong-type-arg
+   #f
+   "Wrong type to apply: ~S"
+   (#f)
+   (#f))
result: FAIL

test-name: random bytevector
location: /tmp/guix-build-guile-lzlib-0.0.2.drv-0/guile-lzlib/tests/lzlib.scm:90
source:
+ (test-assert
+   "random bytevector"
+   (compress-and-decompress
+     (random-bytevector
+       (+ (random 100000) (* 20 1024)))))

;;; ("Uncompressed bytes:" 98099)
actual-value: #f
actual-error:
+ (wrong-type-arg
+   #f
+   "Wrong type to apply: ~S"
+   (#f)
+   (#f))
result: FAIL

test-name: small bytevector
location: /tmp/guix-build-guile-lzlib-0.0.2.drv-0/guile-lzlib/tests/lzlib.scm:93
source:
+ (test-assert
+   "small bytevector"
+   (compress-and-decompress (random-bytevector 127)))

;;; ("Uncompressed bytes:" 127)
actual-value: #f
actual-error:
+ (wrong-type-arg
+   #f
+   "Wrong type to apply: ~S"
+   (#f)
+   (#f))
result: FAIL

test-name: 1 bytevector
location: /tmp/guix-build-guile-lzlib-0.0.2.drv-0/guile-lzlib/tests/lzlib.scm:96
source:
+ (test-assert
+   "1 bytevector"
+   (compress-and-decompress (random-bytevector 1)))

;;; ("Uncompressed bytes:" 1)
actual-value: #f
actual-error:
+ (wrong-type-arg
+   #f
+   "Wrong type to apply: ~S"
+   (#f)
+   (#f))
result: FAIL

test-name: Bytevector of size relative to Lzip internal buffers (2 * dictionary)
location: /tmp/guix-build-guile-lzlib-0.0.2.drv-0/guile-lzlib/tests/lzlib.scm:99
source:
+ (test-assert
+   "Bytevector of size relative to Lzip internal buffers (2 * dictionary)"
+   (compress-and-decompress
+     (random-bytevector
+       (* 2
+          (dictionary-size+match-length-limit
+            %default-compression-level)))))

;;; ("Uncompressed bytes:" 16777216)
actual-value: #f
actual-error:
+ (wrong-type-arg
+   #f
+   "Wrong type to apply: ~S"
+   (#f)
+   (#f))
result: FAIL

test-name: Bytevector of size relative to Lzip internal buffers (64KiB)
location: /tmp/guix-build-guile-lzlib-0.0.2.drv-0/guile-lzlib/tests/lzlib.scm:104
source:
+ (test-assert
+   "Bytevector of size relative to Lzip internal buffers (64KiB)"
+   (compress-and-decompress
+     (random-bytevector (* 64 1024))))

;;; ("Uncompressed bytes:" 65536)
actual-value: #f
actual-error:
+ (wrong-type-arg
+   #f
+   "Wrong type to apply: ~S"
+   (#f)
+   (#f))
result: FAIL

test-name: Bytevector of size relative to Lzip internal buffers (64KiB-1)
location: /tmp/guix-build-guile-lzlib-0.0.2.drv-0/guile-lzlib/tests/lzlib.scm:107
source:
+ (test-assert
+   "Bytevector of size relative to Lzip internal buffers (64KiB-1)"
+   (compress-and-decompress
+     (random-bytevector (#{1-}# (* 64 1024)))))

;;; ("Uncompressed bytes:" 65535)
actual-value: #f
actual-error:
+ (wrong-type-arg
+   #f
+   "Wrong type to apply: ~S"
+   (#f)
+   (#f))
result: FAIL

test-name: Bytevector of size relative to Lzip internal buffers (64KiB+1)
location: /tmp/guix-build-guile-lzlib-0.0.2.drv-0/guile-lzlib/tests/lzlib.scm:110
source:
+ (test-assert
+   "Bytevector of size relative to Lzip internal buffers (64KiB+1)"
+   (compress-and-decompress
+     (random-bytevector (#{1+}# (* 64 1024)))))

;;; ("Uncompressed bytes:" 65537)
actual-value: #f
actual-error:
+ (wrong-type-arg
+   #f
+   "Wrong type to apply: ~S"
+   (#f)
+   (#f))
result: FAIL

test-name: Bytevector of size relative to Lzip internal buffers (1MiB)
location: /tmp/guix-build-guile-lzlib-0.0.2.drv-0/guile-lzlib/tests/lzlib.scm:113
source:
+ (test-assert
+   "Bytevector of size relative to Lzip internal buffers (1MiB)"
+   (compress-and-decompress
+     (random-bytevector (* 1024 1024))))

;;; ("Uncompressed bytes:" 1048576)
random seed for tests: 1611728906
test-name: null bytevector
location: /tmp/guix-build-guile-lzlib-0.0.2.drv-0/guile-lzlib/tests/lzlib.scm:86
source:
+ (test-assert
+   "null bytevector"
+   (compress-and-decompress
+     (make-bytevector (+ (random 100000) (* 20 1024)))))

;;; ("Uncompressed bytes:" 71101)
actual-value: #f
actual-error:
+ (wrong-type-arg
+   #f
+   "Wrong type to apply: ~S"
+   (#f)
+   (#f))
result: FAIL

test-name: random bytevector
location: /tmp/guix-build-guile-lzlib-0.0.2.drv-0/guile-lzlib/tests/lzlib.scm:90
source:
+ (test-assert
+   "random bytevector"
+   (compress-and-decompress
+     (random-bytevector
+       (+ (random 100000) (* 20 1024)))))

;;; ("Uncompressed bytes:" 98099)
actual-value: #f
actual-error:
+ (wrong-type-arg
+   #f
+   "Wrong type to apply: ~S"
+   (#f)
+   (#f))
result: FAIL

test-name: small bytevector
location: /tmp/guix-build-guile-lzlib-0.0.2.drv-0/guile-lzlib/tests/lzlib.scm:93
source:
+ (test-assert
+   "small bytevector"
+   (compress-and-decompress (random-bytevector 127)))

;;; ("Uncompressed bytes:" 127)
actual-value: #f
actual-error:
+ (wrong-type-arg
+   #f
+   "Wrong type to apply: ~S"
+   (#f)
+   (#f))
result: FAIL

test-name: 1 bytevector
location: /tmp/guix-build-guile-lzlib-0.0.2.drv-0/guile-lzlib/tests/lzlib.scm:96
source:
+ (test-assert
+   "1 bytevector"
+   (compress-and-decompress (random-bytevector 1)))

;;; ("Uncompressed bytes:" 1)
actual-value: #f
actual-error:
+ (wrong-type-arg
+   #f
+   "Wrong type to apply: ~S"
+   (#f)
+   (#f))
result: FAIL

test-name: Bytevector of size relative to Lzip internal buffers (2 * dictionary)
location: /tmp/guix-build-guile-lzlib-0.0.2.drv-0/guile-lzlib/tests/lzlib.scm:99
source:
+ (test-assert
+   "Bytevector of size relative to Lzip internal buffers (2 * dictionary)"
+   (compress-and-decompress
+     (random-bytevector
+       (* 2
+          (dictionary-size+match-length-limit
+            %default-compression-level)))))

;;; ("Uncompressed bytes:" 16777216)
actual-value: #f
actual-error:
+ (wrong-type-arg
+   #f
+   "Wrong type to apply: ~S"
+   (#f)
+   (#f))
result: FAIL

test-name: Bytevector of size relative to Lzip internal buffers (64KiB)
location: /tmp/guix-build-guile-lzlib-0.0.2.drv-0/guile-lzlib/tests/lzlib.scm:104
source:
+ (test-assert
+   "Bytevector of size relative to Lzip internal buffers (64KiB)"
+   (compress-and-decompress
+     (random-bytevector (* 64 1024))))

;;; ("Uncompressed bytes:" 65536)
actual-value: #f
actual-error:
+ (wrong-type-arg
+   #f
+   "Wrong type to apply: ~S"
+   (#f)
+   (#f))
result: FAIL

test-name: Bytevector of size relative to Lzip internal buffers (64KiB-1)
location: /tmp/guix-build-guile-lzlib-0.0.2.drv-0/guile-lzlib/tests/lzlib.scm:107
source:
+ (test-assert
+   "Bytevector of size relative to Lzip internal buffers (64KiB-1)"
+   (compress-and-decompress
+     (random-bytevector (#{1-}# (* 64 1024)))))

;;; ("Uncompressed bytes:" 65535)
actual-value: #f
actual-error:
+ (wrong-type-arg
+   #f
+   "Wrong type to apply: ~S"
+   (#f)
+   (#f))
result: FAIL

test-name: Bytevector of size relative to Lzip internal buffers (64KiB+1)
location: /tmp/guix-build-guile-lzlib-0.0.2.drv-0/guile-lzlib/tests/lzlib.scm:110
source:
+ (test-assert
+   "Bytevector of size relative to Lzip internal buffers (64KiB+1)"
+   (compress-and-decompress
+     (random-bytevector (#{1+}# (* 64 1024)))))

;;; ("Uncompressed bytes:" 65537)
actual-value: #f
actual-error:
+ (wrong-type-arg
+   #f
+   "Wrong type to apply: ~S"
+   (#f)
+   (#f))
result: FAIL

test-name: Bytevector of size relative to Lzip internal buffers (1MiB)
location: /tmp/guix-build-guile-lzlib-0.0.2.drv-0/guile-lzlib/tests/lzlib.scm:113
source:
+ (test-assert
+   "Bytevector of size relative to Lzip internal buffers (1MiB)"
+   (compress-and-decompress
+     (random-bytevector (* 1024 1024))))

;;; ("Uncompressed bytes:" 1048576)
actual-value: #f
actual-error:
+ (wrong-type-arg
+   #f
+   "Wrong type to apply: ~S"
+   (#f)
+   (#f))
result: FAIL

test-name: Bytevector of size relative to Lzip internal buffers (1MiB-1)
location: /tmp/guix-build-guile-lzlib-0.0.2.drv-0/guile-lzlib/tests/lzlib.scm:116
source:
+ (test-assert
+   "Bytevector of size relative to Lzip internal buffers (1MiB-1)"
+   (compress-and-decompress
+     (random-bytevector (#{1-}# (* 1024 1024)))))

;;; ("Uncompressed bytes:" 1048575)
random seed for tests: 1611728906
/tmp/guix-build-guile-lzlib-0.0.2.drv-0/guile-lzlib/tests/lzlib.scm:116
source:
+ (test-assert
+   "Bytevector of size relative to Lzip internal buffers (1MiB-1)"
+   (compress-and-decompress
+     (random-bytevector (#{1-}# (* 1024 1024)))))

;;; ("Uncompressed bytes:" 1048575)
actual-value: #f
actual-error:
+ (wrong-type-arg
+   #f
+   "Wrong type to apply: ~S"
+   (#f)
+   (#f))
result: FAIL

test-name: Bytevector of size relative to Lzip internal buffers (1MiB+1)
location: /tmp/guix-build-guile-lzlib-0.0.2.drv-0/guile-lzlib/tests/lzlib.scm:119
source:
+ (test-assert
+   "Bytevector of size relative to Lzip internal buffers (1MiB+1)"
+   (compress-and-decompress
+     (random-bytevector (#{1+}# (* 1024 1024)))))

;;; ("Uncompressed bytes:" 1048577)
random seed for tests: 1611728906
/tmp/guix-build-guile-lzlib-0.0.2.drv-0/guile-lzlib/tests/lzlib.scm:116
source:
+ (test-assert
+   "Bytevector of size relative to Lzip internal buffers (1MiB-1)"
+   (compress-and-decompress
+     (random-bytevector (#{1-}# (* 1024 1024)))))

;;; ("Uncompressed bytes:" 1048575)
actual-value: #f
actual-error:
+ (wrong-type-arg
+   #f
+   "Wrong type to apply: ~S"
+   (#f)
+   (#f))
result: FAIL

test-name: Bytevector of size relative to Lzip internal buffers (1MiB+1)
location: /tmp/guix-build-guile-lzlib-0.0.2.drv-0/guile-lzlib/tests/lzlib.scm:119
source:
+ (test-assert
+   "Bytevector of size relative to Lzip internal buffers (1MiB+1)"
+   (compress-and-decompress
+     (random-bytevector (#{1+}# (* 1024 1024)))))

;;; ("Uncompressed bytes:" 1048577)
actual-value: #f
actual-error:
+ (wrong-type-arg
+   #f
+   "Wrong type to apply: ~S"
+   (#f)
+   (#f))
result: FAIL

test-name: make-lzip-input-port/compressed
location: /tmp/guix-build-guile-lzlib-0.0.2.drv-0/guile-lzlib/tests/lzlib.scm:122
source:
+ (test-assert
+   "make-lzip-input-port/compressed"
+   (let* ((len (pk 'len (+ 10 (random 4000 %seed))))
+          (data (random-bytevector len))
+          (compressed
+            (make-lzip-input-port/compressed
+              (open-bytevector-input-port data)))
+          (result
+            (call-with-lzip-input-port
+              compressed
+              get-bytevector-all)))
+     (pk (bytevector-length result)
+         (bytevector-length data))
+     (bytevector=? result data)))

;;; (len 3527)
actual-value: #f
actual-error:
+ (wrong-type-arg
+   #f
+   "Wrong type to apply: ~S"
+   (#f)
+   (#f))
result: FAIL

random seed for tests: 1611728906


command "make" "check" "-j" "4" "GUILE_AUTO_COMPILE=0" failed with status 2
builder for `/gnu/store/1v3a974h6rfgyqlwjilygi8jzl2hfxd8-guile-lzlib-0.0.2.drv' failed with exit code 1
@ build-failed /gnu/store/1v3a974h6rfgyqlwjilygi8jzl2hfxd8-guile-lzlib-0.0.2.drv - 1 builder for `/gnu/store/1v3a974h6rfgyqlwjilygi8jzl2hfxd8-guile-lzlib-0.0.2.drv' failed with exit code 1
cannot build derivation `/gnu/store/c5kncqfsv03q72mcwkxm6hbznyy2j0dv-guix-daemon-1.2.0-11.d4a562b.drv': 1 dependencies couldn't be built
Backtrace:
          11 (primitive-load "/gnu/store/dgkzlgsb36623vfblfi0s5pz8bgz96my-compute-guix-derivation")
In ice-9/eval.scm:
    155:9 10 (_ _)
    159:9  9 (_ #(#(#(#(#(#(#(#(#(#(#(#(#(#<directory (guile-user) 3dfb97d0> (?)) #) ?) ?) #) ?) #) ?) #) #) #) #) #))
In ./guix/store.scm:
  2062:24  8 (run-with-store #<store-connection 256.99 3c62fc58> _ #:guile-for-build _ #:system _ #:target _)
   1896:8  7 (_ _)
In ./guix/gexp.scm:
   258:18  6 (_ _)
   1123:2  5 (_ _)
    982:2  4 (_ _)
    843:4  3 (_ _)
In ./guix/store.scm:
  1944:12  2 (_ #<store-connection 256.99 3c62fc58>)
   1362:5  1 (map/accumulate-builds #<store-connection 256.99 3c62fc58> _ _)
  1373:15  0 (_ #<store-connection 256.99 3c62fc58> _ _)

./guix/store.scm:1373:15: ERROR:
  1. &store-protocol-error:
      message: "build of `/gnu/store/c5kncqfsv03q72mcwkxm6hbznyy2j0dv-guix-daemon-1.2.0-11.d4a562b.drv' failed"
      status: 100
error: while computing manifest entry derivation for armhf-linux
error %exception: (#<&message message: "You found a bug: the program '/gnu/store/dgkzlgsb36623vfblfi0s5pz8bgz96my-compute-guix-derivation'\nfailed to compute the derivation for Guix (version: \"181444fe3f7dd1f6c7f7d50f699774db2b2323ca\"; system: \"armhf-linux\";\nhost version: \"1.2.0-8.7624ebb\"; pull-version: 1).\nPlease report it by email to <bug-guix@gnu.org>.\n">)
guix-data-service: computing the derivation-file-name for aarch64-linux
Computing Guix derivation for 'aarch64-linux'...  
guix-data-service: computing the derivation-file-name for mips64el-linux
@ build-started /gnu/store/yx69vp44jkhn06vfnavvzsp0ywvamj3c-guile-bootstrap-2.0.drv - mips64el-linux /var/log/guix/drvs/yx//69vp44jkhn06vfnavvzsp0ywvamj3c-guile-bootstrap-2.0.drv.bz2 25227
@ unsupported-platform /gnu/store/yx69vp44jkhn06vfnavvzsp0ywvamj3c-guile-bootstrap-2.0.drv mips64el-linux
while setting up the build environment: a `mips64el-linux' is required to build `/gnu/store/yx69vp44jkhn06vfnavvzsp0ywvamj3c-guile-bootstrap-2.0.drv', but I am a `x86_64-linux'
builder for `/gnu/store/yx69vp44jkhn06vfnavvzsp0ywvamj3c-guile-bootstrap-2.0.drv' failed with exit code 1
@ build-failed /gnu/store/yx69vp44jkhn06vfnavvzsp0ywvamj3c-guile-bootstrap-2.0.drv - 1 builder for `/gnu/store/yx69vp44jkhn06vfnavvzsp0ywvamj3c-guile-bootstrap-2.0.drv' failed with exit code 1
cannot build derivation `/gnu/store/dxq4pywr7lgh3dd43ib22hfpj34friya-bash-minimal-5.0.16.drv': 1 dependencies couldn't be built
cannot build derivation `/gnu/store/f5vscmzihgcv875jvhd71fcb83swf23s-binutils-2.34.drv': 1 dependencies couldn't be built
cannot build derivation `/gnu/store/95332a4b4yq67gmsjzkw2q6gfrxynmfp-binutils-cross-boot0-2.34.drv': 1 dependencies couldn't be built
cannot build derivation `/gnu/store/y2iixw7jxvz34y7sh3lmsf5sw9hbqm3h-bootstrap-binaries-0.drv': 1 dependencies couldn't be built
cannot build derivation `/gnu/store/3yj0v338l51r5n5x8zssdpk7wi6pr5ai-coreutils-8.32.tar.xz.drv': 1 dependencies couldn't be built
cannot build derivation `/gnu/store/5msm6qmizvx19di70svaqdjvdjri57mn-diffutils-boot0-3.7.drv': 1 dependencies couldn't be built
cannot build derivation `/gnu/store/0ylf94w2pzlrlsqfawizlzr88p83x792-file-boot0-5.38.drv': 1 dependencies couldn't be built
cannot build derivation `/gnu/store/8mvxijpp08vw2kmk0167i57niihc8vhc-findutils-4.7.0.tar.xz.drv': 1 dependencies couldn't be built
cannot build derivation `/gnu/store/y0z9bp3x79n0rjgwi8h46arr883154ap-findutils-boot0-4.7.0.drv': 1 dependencies couldn't be built
cannot build derivation `/gnu/store/x6c5d3la5jcxp9bqnsdjridczhkys4ps-gcc-7.5.0.drv': 1 dependencies couldn't be built
cannot build derivation `/gnu/store/ma97vwnwmapvrq8lvgcxycxqgc8cbph1-glibc-2.31.drv': 1 dependencies couldn't be built
cannot build derivation `/gnu/store/r738zyln6sj9kcdhsqw0s0ri464qza7n-gmp-6.2.0.drv': 1 dependencies couldn't be built
cannot build derivation `/gnu/store/qc3yd860wk6vcmdp2b5rwx6x8fck9l49-grep-3.4.tar.xz.drv': 1 dependencies couldn't be built
cannot build derivation `/gnu/store/syzg38yfdy2543rlcwssrphyljax0jnj-guile-3.0.2.drv': 1 dependencies couldn't be built
cannot build derivation `/gnu/store/20d888jc67j0gkbnf55kamybxig8fqvv-gzip-1.10.drv': 1 dependencies couldn't be built
cannot build derivation `/gnu/store/66d3vhqvjbnam0wh8xhh054kr7n8gm83-ld-wrapper-boot0-0.drv': 1 dependencies couldn't be built
cannot build derivation `/gnu/store/mvi7yz80zh67xiv50yjnx339pkbr7vy3-ld-wrapper-boot3-0.drv': 1 dependencies couldn't be built
cannot build derivation `/gnu/store/fffr7rm5akqp9kg1vsjaihd15nb0pndm-libgc-8.0.4.drv': 1 dependencies couldn't be built
cannot build derivation `/gnu/store/7ibi9p3bgjf5n6hi3d3bplaycdjhz060-libltdl-2.4.6.drv': 1 dependencies couldn't be built
cannot build derivation `/gnu/store/8k5nnlq47jb3ap8w1iq3lbhr85592fn9-libunistring-0.9.10.drv': 1 dependencies couldn't be built
cannot build derivation `/gnu/store/pb4igk4iw823mlhsvwr4ncxjjys3lq68-linux-libre-headers-5.4.20.drv': 1 dependencies couldn't be built
cannot build derivation `/gnu/store/ghsd7fis4wqkwy5vh329p78wcfkvcd8n-make-4.3.tar.xz.drv': 1 dependencies couldn't be built
cannot build derivation `/gnu/store/8wcyf5fhisiblai7bklbir29raz2xns7-make-boot0-4.3.drv': 1 dependencies couldn't be built
cannot build derivation `/gnu/store/45b8y8822rd09lh438pcqhg44971l4x6-patch-2.7.6.tar.xz.drv': 1 dependencies couldn't be built
cannot build derivation `/gnu/store/7kymdyccqavdi93ih2nn2hm4r7zxqwa5-perl-5.30.2.tar.xz.drv': 1 dependencies couldn't be built
cannot build derivation `/gnu/store/j2dwzi5jzdzs35mnsskxl69wlw2m1ilv-perl-boot0-5.30.2.drv': 1 dependencies couldn't be built
cannot build derivation `/gnu/store/sc45aw49fpaqzzy39bak22c2vp3m33cx-tar-1.32.tar.xz.drv': 1 dependencies couldn't be built
cannot build derivation `/gnu/store/wh7yi4z3m2zrw02byqmp4xpddrrrvprs-compute-guix-derivation.drv': 1 dependencies couldn't be built
error: while computing manifest entry derivation for mips64el-linux
error %exception: (#<&store-protocol-error message: "build of `/gnu/store/wh7yi4z3m2zrw02byqmp4xpddrrrvprs-compute-guix-derivation.drv' failed" status: 100>)
guix-data-service: computing the derivation-file-name for i586-gnu
@ build-started /gnu/store/zcaxvsp8klsqgv8gc2sfvy9i03xsg5rp-config.scm.drv - i586-gnu /var/log/guix/drvs/zc//axvsp8klsqgv8gc2sfvy9i03xsg5rp-config.scm.drv.bz2 25242
@ build-started /gnu/store/w2ycyh4jrmy4fx2m96371sms57l9kah8-git.scm.drv - i586-gnu /var/log/guix/drvs/w2//ycyh4jrmy4fx2m96371sms57l9kah8-git.scm.drv.bz2 25244
@ build-started /gnu/store/n91a4wbwkrmqyikglrk30zvby9izsm6i-hash.scm.drv - i586-gnu /var/log/guix/drvs/n9//1a4wbwkrmqyikglrk30zvby9izsm6i-hash.scm.drv.bz2 25247
@ unsupported-platform /gnu/store/zcaxvsp8klsqgv8gc2sfvy9i03xsg5rp-config.scm.drv i586-gnu
while setting up the build environment: a `i586-gnu' is required to build `/gnu/store/zcaxvsp8klsqgv8gc2sfvy9i03xsg5rp-config.scm.drv', but I am a `x86_64-linux'
@ unsupported-platform /gnu/store/w2ycyh4jrmy4fx2m96371sms57l9kah8-git.scm.drv i586-gnu
while setting up the build environment: a `i586-gnu' is required to build `/gnu/store/w2ycyh4jrmy4fx2m96371sms57l9kah8-git.scm.drv', but I am a `x86_64-linux'
@ unsupported-platform /gnu/store/n91a4wbwkrmqyikglrk30zvby9izsm6i-hash.scm.drv i586-gnu
while setting up the build environment: a `i586-gnu' is required to build `/gnu/store/n91a4wbwkrmqyikglrk30zvby9izsm6i-hash.scm.drv', but I am a `x86_64-linux'
builder for `/gnu/store/zcaxvsp8klsqgv8gc2sfvy9i03xsg5rp-config.scm.drv' failed with exit code 1
@ build-failed /gnu/store/zcaxvsp8klsqgv8gc2sfvy9i03xsg5rp-config.scm.drv - 1 builder for `/gnu/store/zcaxvsp8klsqgv8gc2sfvy9i03xsg5rp-config.scm.drv' failed with exit code 1
builder for `/gnu/store/w2ycyh4jrmy4fx2m96371sms57l9kah8-git.scm.drv' failed with exit code 1
@ build-failed /gnu/store/w2ycyh4jrmy4fx2m96371sms57l9kah8-git.scm.drv - 1 builder for `/gnu/store/w2ycyh4jrmy4fx2m96371sms57l9kah8-git.scm.drv' failed with exit code 1
cannot build derivation `/gnu/store/b8l17l6n6y92pz5c81qnk86zvzl22jma-module-import.drv': 1 dependencies couldn't be built
cannot build derivation `/gnu/store/7vcv8qwakqs504ddd8g8lfbf2fs24dmm-compute-guix-derivation.drv': 1 dependencies couldn't be built
error: while computing manifest entry derivation for i586-gnu
error %exception: (#<&store-protocol-error message: "build of `/gnu/store/7vcv8qwakqs504ddd8g8lfbf2fs24dmm-compute-guix-derivation.drv' failed" status: 100>)
debug: Finished computing the channel derivation, took 940 seconds
debug: x86_64-linux: channel dervation: ((manifest-entry-item . /gnu/store/vgi955nvdgj49jvxmc0svwnlv2gljnqq-guix-181444fe3.drv) (profile . /gnu/store/80w9s5v6ig54w34j0jphvimb2xzgxm18-profile.drv))
debug: i686-linux: channel dervation: ((manifest-entry-item . /gnu/store/bkjj6w2cdrj4flczfzbm5jvmj2cyq043-guix-181444fe3.drv) (profile . /gnu/store/mmxx0wddpacr3a269n9cib3i520da47s-profile.drv))
debug: armhf-linux: channel dervation: ((manifest-entry-item . #f) (profile . #f))
debug: aarch64-linux: channel dervation: ((manifest-entry-item . /gnu/store/nswq0025flc9b5lzqarnp54mk7d872xb-guix-181444fe3.drv) (profile . /gnu/store/3g0h05cx041wgjpfd02ns0wlxvyd3wk1-profile.drv))
debug: mips64el-linux: channel dervation: ((manifest-entry-item . #f) (profile . #f))
debug: i586-gnu: channel dervation: ((manifest-entry-item . #f) (profile . #f))
debug: Starting building the channel derivation
substitute: 
substitute: updating substitutes from 'https://ci.guix.gnu.org'...   0.0%
substitute: updating substitutes from 'https://ci.guix.gnu.org'... 100.0%
substitute: 
substitute: updating substitutes from 'https://ci.guix.gnu.org'...   0.0%
substitute: updating substitutes from 'https://ci.guix.gnu.org'... 100.0%
substitute: 
substitute: updating substitutes from 'https://ci.guix.gnu.org'...   0.0%
substitute: updating substitutes from 'https://ci.guix.gnu.org'... 100.0%
substitute: 
substitute: updating substitutes from 'https://ci.guix.gnu.org'...   0.0%
substitute: updating substitutes from 'https://ci.guix.gnu.org'... 100.0%
substitute: 
substitute: updating substitutes from 'https://ci.guix.gnu.org'...   0.0%
substitute: updating substitutes from 'https://ci.guix.gnu.org'... 100.0%
substitute: 
substitute: updating substitutes from 'https://ci.guix.gnu.org'...   0.0%
substitute: updating substitutes from 'https://ci.guix.gnu.org'... 100.0%
substitute: 
substitute: updating substitutes from 'https://ci.guix.gnu.org'...   0.0%
substitute: updating substitutes from 'https://ci.guix.gnu.org'... 100.0%
substitute: 
substitute: updating substitutes from 'https://ci.guix.gnu.org'...   0.0%
substitute: updating substitutes from 'https://ci.guix.gnu.org'... 100.0%
substitute: 
substitute: updating substitutes from 'https://ci.guix.gnu.org'...   0.0%
substitute: updating substitutes from 'https://ci.guix.gnu.org'... 100.0%
substitute: 
substitute: updating substitutes from 'https://ci.guix.gnu.org'...   0.0%
substitute: updating substitutes from 'https://ci.guix.gnu.org'... 100.0%
substitute: 
substitute: updating substitutes from 'https://ci.guix.gnu.org'...   0.0%
substitute: updating substitutes from 'https://ci.guix.gnu.org'... 100.0%
substitute: 
substitute: updating substitutes from 'https://ci.guix.gnu.org'...   0.0%
substitute: updating substitutes from 'https://ci.guix.gnu.org'... 100.0%
substitute: 
substitute: updating substitutes from 'https://ci.guix.gnu.org'...   0.0%
substitute: updating substitutes from 'https://ci.guix.gnu.org'... 100.0%
substitute: 
substitute: updating substitutes from 'https://ci.guix.gnu.org'...   0.0%
substitute: updating substitutes from 'https://ci.guix.gnu.org'... 100.0%
@ substituter-started /gnu/store/yxx37qhjypfh257vqrh3zpsq2d1s47vv-guix-packages-base substitute
@ substituter-started /gnu/store/zn176wcfsb395z3z8kb775vk05flik0a-guix-system substitute
@ substituter-started /gnu/store/6qi7sihfqcgxz3dqfqw20mx9w8jqswcz-guix-system-tests substitute
Downloading https://ci.guix.gnu.org/nar/lzip/yxx37qhjypfh257vqrh3zpsq2d1s47vv-guix-packages-base...
Downloading https://ci.guix.gnu.org/nar/lzip/6qi7sihfqcgxz3dqfqw20mx9w8jqswcz-guix-system-tests...
Downloading https://ci.guix.gnu.org/nar/lzip/zn176wcfsb395z3z8kb775vk05flik0a-guix-system...

 guix-packages-base  9.1MiB                                                                                                                                                                                              0B/s 00:00 [                  ]   0.0%
 guix-packages-base  9.1MiB                                                                                                                                                                                          2.5MiB/s 00:00 [                  ]   0.7%
 guix-system-tests  299KiB                                                                                                                                                                                               0B/s 00:00 [                  ]   0.0%
 guix-system  5.3MiB                                                                                                                                                                                                     0B/s 00:00 [                  ]   0.0%
 guix-system-tests  299KiB                                                                                                                                                                                           2.6MiB/s 00:00 [###               ]  21.4%
 guix-system  5.3MiB                                                                                                                                                                                                 2.8MiB/s 00:00 [                  ]   1.2%
 guix-system-tests  299KiB                                                                                                                                                                                           2.8MiB/s 00:00 [##################] 100.0%

@ substituter-succeeded /gnu/store/6qi7sihfqcgxz3dqfqw20mx9w8jqswcz-guix-system-tests
@ substituter-started /gnu/store/7rcr578krdljl6paji678gxsfc93q88y-guix-cli substitute

 guix-packages-base  9.1MiB                                                                                                                                                                                          3.8MiB/s 00:00 [#                 ]   9.6%
 guix-system  5.3MiB                                                                                                                                                                                                 4.6MiB/s 00:00 [###               ]  20.1%Downloading https://ci.guix.gnu.org/nar/lzip/7rcr578krdljl6paji678gxsfc93q88y-guix-cli...

 guix-packages-base  9.1MiB                                                                                                                                                                                          4.8MiB/s 00:00 [####              ]  22.7%
 guix-system  5.3MiB                                                                                                                                                                                                 5.3MiB/s 00:00 [#######           ]  43.8%
 guix-cli  715KiB                                                                                                                                                                                                        0B/s 00:00 [                  ]   0.0%
 guix-cli  715KiB                                                                                                                                                                                                    2.5MiB/s 00:00 [#                 ]   9.0%
 guix-packages-base  9.1MiB                                                                                                                                                                                          5.4MiB/s 00:01 [######            ]  37.8%
 guix-system  5.3MiB                                                                                                                                                                                                 5.5MiB/s 00:01 [############      ]  67.5%
 guix-cli  715KiB                                                                                                                                                                                                    3.8MiB/s 00:00 [##################] 100.0%

@ substituter-succeeded /gnu/store/7rcr578krdljl6paji678gxsfc93q88y-guix-cli
@ substituter-started /gnu/store/bsk1df033jd2wny5vs9ils4ys7riz8w9-guix-system-tests-modules substitute

 guix-packages-base  9.1MiB                                                                                                                                                                                          5.4MiB/s 00:01 [#########         ]  50.2%
 guix-system  5.3MiB                                                                                                                                                                                                 5.8MiB/s 00:01 [################  ]  93.6%
 guix-system  5.3MiB                                                                                                                                                                                                 5.7MiB/s 00:01 [##################] 100.0%

@ substituter-succeeded /gnu/store/zn176wcfsb395z3z8kb775vk05flik0a-guix-system
@ substituter-started /gnu/store/xchz5riyx4cky7np3fpxz8y19436lmxv-guix-cli-modules substitute

 guix-packages-base  9.1MiB                                                                                                                                                                                          5.6MiB/s 00:01 [###########       ]  64.6%
 guix-packages-base  9.1MiB                                                                                                                                                                                          5.7MiB/s 00:01 [##############    ]  79.0%
 guix-packages-base  9.1MiB                                                                                                                                                                                          5.7MiB/s 00:01 [################  ]  92.8%Downloading https://ci.guix.gnu.org/nar/gzip/bsk1df033jd2wny5vs9ils4ys7riz8w9-guix-system-tests-modules...

 guix-system-tests-modules  276B                                                                                                                                                                                         0B/s 00:00 [                  ]   0.0%
 guix-system-tests-modules  276B                                                                                                                                                                                      21KiB/s 00:00 [##################] 100.0%
 guix-system-tests-modules  276B                                                                                                                                                                                      16KiB/s 00:00 [##################] 100.0%

@ substituter-succeeded /gnu/store/bsk1df033jd2wny5vs9ils4ys7riz8w9-guix-system-tests-modules
@ substituter-started /gnu/store/zfh6il9mirav1bgwvj8hbg6pvs7ajcqq-guix-system-modules substitute

 guix-packages-base  9.1MiB                                                                                                                                                                                          5.7MiB/s 00:02 [##################] 100.0%

@ substituter-succeeded /gnu/store/yxx37qhjypfh257vqrh3zpsq2d1s47vv-guix-packages-base
@ substituter-started /gnu/store/mrzsqka3vx4dz65v82zci6cx11znzka3-guix-packages-base-modules substitute
Downloading https://ci.guix.gnu.org/nar/gzip/xchz5riyx4cky7np3fpxz8y19436lmxv-guix-cli-modules...

 guix-cli-modules  267B                                                                                                                                                                                                  0B/s 00:00 [                  ]   0.0%
 guix-cli-modules  267B                                                                                                                                                                                               52KiB/s 00:00 [##################] 100.0%
 guix-cli-modules  267B                                                                                                                                                                                               22KiB/s 00:00 [##################] 100.0%

Downloading https://ci.guix.gnu.org/nar/gzip/zfh6il9mirav1bgwvj8hbg6pvs7ajcqq-guix-system-modules...

 guix-system-modules  270B                                                                                                                                                                                               0B/s 00:00 [                  ]   0.0%
 guix-system-modules  270B                                                                                                                                                                                            17KiB/s 00:00 [##################] 100.0%
 guix-system-modules  270B                                                                                                                                                                                            15KiB/s 00:00 [##################] 100.0%

@ substituter-succeeded /gnu/store/xchz5riyx4cky7np3fpxz8y19436lmxv-guix-cli-modules
@ substituter-succeeded /gnu/store/zfh6il9mirav1bgwvj8hbg6pvs7ajcqq-guix-system-modules
Downloading https://ci.guix.gnu.org/nar/gzip/mrzsqka3vx4dz65v82zci6cx11znzka3-guix-packages-base-modules...

 guix-packages-base-modules  276B                                                                                                                                                                                        0B/s 00:00 [                  ]   0.0%
 guix-packages-base-modules  276B                                                                                                                                                                                     63KiB/s 00:00 [##################] 100.0%
 guix-packages-base-modules  276B                                                                                                                                                                                     42KiB/s 00:00 [##################] 100.0%

@ substituter-succeeded /gnu/store/mrzsqka3vx4dz65v82zci6cx11znzka3-guix-packages-base-modules
@ substituter-started /gnu/store/gzggc55aw7sbxjshg904hlylppnbb160-guix-181444fe3-modules substitute
Downloading https://ci.guix.gnu.org/nar/lzip/gzggc55aw7sbxjshg904hlylppnbb160-guix-181444fe3-modules...

 guix-181444fe3-modules  19.7MiB                                                                                                                                                                                         0B/s 00:00 [                  ]   0.0%
 guix-181444fe3-modules  19.7MiB                                                                                                                                                                                     2.6MiB/s 00:00 [                  ]   0.3%
 guix-181444fe3-modules  19.7MiB                                                                                                                                                                                     4.4MiB/s 00:00 [                  ]   5.1%
 guix-181444fe3-modules  19.7MiB                                                                                                                                                                                     5.3MiB/s 00:00 [##                ]  11.8%
 guix-181444fe3-modules  19.7MiB                                                                                                                                                                                     5.4MiB/s 00:01 [###               ]  17.5%
 guix-181444fe3-modules  19.7MiB                                                                                                                                                                                     5.6MiB/s 00:01 [####              ]  23.8%
 guix-181444fe3-modules  19.7MiB                                                                                                                                                                                     5.7MiB/s 00:01 [#####             ]  30.5%
 guix-181444fe3-modules  19.7MiB                                                                                                                                                                                     5.8MiB/s 00:01 [######            ]  37.2%
 guix-181444fe3-modules  19.7MiB                                                                                                                                                                                     5.9MiB/s 00:01 [#######           ]  43.9%
 guix-181444fe3-modules  19.7MiB                                                                                                                                                                                     5.9MiB/s 00:02 [#########         ]  50.2%
 guix-181444fe3-modules  19.7MiB                                                                                                                                                                                     5.9MiB/s 00:02 [##########        ]  56.3%
 guix-181444fe3-modules  19.7MiB                                                                                                                                                                                     5.8MiB/s 00:02 [###########       ]  61.7%
 guix-181444fe3-modules  19.7MiB                                                                                                                                                                                     5.7MiB/s 00:02 [###########       ]  66.5%
 guix-181444fe3-modules  19.7MiB                                                                                                                                                                                     5.6MiB/s 00:02 [############      ]  71.2%
 guix-181444fe3-modules  19.7MiB                                                                                                                                                                                     5.6MiB/s 00:03 [#############     ]  77.3%
 guix-181444fe3-modules  19.7MiB                                                                                                                                                                                     5.6MiB/s 00:03 [##############    ]  82.0%
 guix-181444fe3-modules  19.7MiB                                                                                                                                                                                     5.6MiB/s 00:03 [###############   ]  88.4%
 guix-181444fe3-modules  19.7MiB                                                                                                                                                                                     5.7MiB/s 00:03 [################# ]  95.4%
 guix-181444fe3-modules  19.7MiB                                                                                                                                                                                     5.7MiB/s 00:03 [##################] 100.0%

@ substituter-succeeded /gnu/store/gzggc55aw7sbxjshg904hlylppnbb160-guix-181444fe3-modules
@ substituter-started /gnu/store/jsgqqb14lrgi7ihfl8r4sd1094hf2lyl-guix-module-union substitute
Downloading https://ci.guix.gnu.org/nar/lzip/jsgqqb14lrgi7ihfl8r4sd1094hf2lyl-guix-module-union...

 guix-module-union  2KiB                                                                                                                                                                                                 0B/s 00:00 [                  ]   0.0%
 guix-module-union  2KiB                                                                                                                                                                                             382KiB/s 00:00 [##################] 100.0%
 guix-module-union  2KiB                                                                                                                                                                                              87KiB/s 00:00 [##################] 100.0%

@ substituter-succeeded /gnu/store/jsgqqb14lrgi7ihfl8r4sd1094hf2lyl-guix-module-union
@ substituter-started /gnu/store/kd2csfslh4302r31w3m49957c5l46ckw-guix-command substitute
Downloading https://ci.guix.gnu.org/nar/gzip/kd2csfslh4302r31w3m49957c5l46ckw-guix-command...

 guix-command  634B                                                                                                                                                                                                      0B/s 00:00 [                  ]   0.0%
 guix-command  634B                                                                                                                                                                                                  103KiB/s 00:00 [##################] 100.0%
 guix-command  634B                                                                                                                                                                                                   54KiB/s 00:00 [##################] 100.0%

@ substituter-succeeded /gnu/store/kd2csfslh4302r31w3m49957c5l46ckw-guix-command
@ substituter-started /gnu/store/rym2n5rf297zk5xgshgymy15s9gddxkg-guix-daemon substitute
Downloading https://ci.guix.gnu.org/nar/gzip/rym2n5rf297zk5xgshgymy15s9gddxkg-guix-daemon...

 guix-daemon  395B                                                                                                                                                                                                       0B/s 00:00 [                  ]   0.0%
 guix-daemon  395B                                                                                                                                                                                                    47KiB/s 00:00 [##################] 100.0%
 guix-daemon  395B                                                                                                                                                                                                    29KiB/s 00:00 [##################] 100.0%

@ substituter-succeeded /gnu/store/rym2n5rf297zk5xgshgymy15s9gddxkg-guix-daemon
@ substituter-started /gnu/store/jhrndjkjanawiwhzgwdgpss8j53vkdgr-guix-181444fe3 substitute
Downloading https://ci.guix.gnu.org/nar/lzip/jhrndjkjanawiwhzgwdgpss8j53vkdgr-guix-181444fe3...

 guix-181444fe3  12KiB                                                                                                                                                                                                   0B/s 00:00 [                  ]   0.0%
 guix-181444fe3  12KiB                                                                                                                                                                                               2.7MiB/s 00:00 [##################] 100.0%
 guix-181444fe3  12KiB                                                                                                                                                                                               961KiB/s 00:00 [##################] 100.0%

@ substituter-succeeded /gnu/store/jhrndjkjanawiwhzgwdgpss8j53vkdgr-guix-181444fe3
@ build-started /gnu/store/hmi6w86zgbwijw6x5akxmhy7c5nnd4d3-ca-certificate-bundle.drv - x86_64-linux /var/log/guix/drvs/hm//i6w86zgbwijw6x5akxmhy7c5nnd4d3-ca-certificate-bundle.drv.bz2 25350
@ build-started /gnu/store/f43gi6sngw9lcwn9mzrbn1ywp8zy0yiv-fonts-dir.drv - x86_64-linux /var/log/guix/drvs/f4//3gi6sngw9lcwn9mzrbn1ywp8zy0yiv-fonts-dir.drv.bz2 25355
@ build-started /gnu/store/bjb0xm1kad14w3rvdgq96ci4shz2762j-info-dir.drv - x86_64-linux /var/log/guix/drvs/bj//b0xm1kad14w3rvdgq96ci4shz2762j-info-dir.drv.bz2 25360
@ build-succeeded /gnu/store/hmi6w86zgbwijw6x5akxmhy7c5nnd4d3-ca-certificate-bundle.drv -
@ build-started /gnu/store/lfzlhg4dh440alv1297v6wzhqcir8jl8-manual-database.drv - x86_64-linux /var/log/guix/drvs/lf//zlhg4dh440alv1297v6wzhqcir8jl8-manual-database.drv.bz2 25369
@ build-succeeded /gnu/store/f43gi6sngw9lcwn9mzrbn1ywp8zy0yiv-fonts-dir.drv -
@ build-started /gnu/store/3nqz20zzr9578v5vmzdshi74xi4wc90n-profile.drv - x86_64-linux /var/log/guix/drvs/3n//qz20zzr9578v5vmzdshi74xi4wc90n-profile.drv.bz2 25382
Creating manual page database...

[  1/  1] building list of man-db entries...
0 entries processed in 0.0 s
@ build-succeeded /gnu/store/lfzlhg4dh440alv1297v6wzhqcir8jl8-manual-database.drv -
@ build-succeeded /gnu/store/3nqz20zzr9578v5vmzdshi74xi4wc90n-profile.drv -
@ build-started /gnu/store/9gzbv7rgn3pkqmql8p58zx8kz1n9xa4k-inferior-script.scm.drv - x86_64-linux /var/log/guix/drvs/9g//zbv7rgn3pkqmql8p58zx8kz1n9xa4k-inferior-script.scm.drv.bz2 25410
@ build-succeeded /gnu/store/bjb0xm1kad14w3rvdgq96ci4shz2762j-info-dir.drv -
@ build-succeeded /gnu/store/9gzbv7rgn3pkqmql8p58zx8kz1n9xa4k-inferior-script.scm.drv -
@ build-started /gnu/store/wx07bpmd11wpacmisfpxgxg3svv303yp-guix-package-cache.drv - x86_64-linux /var/log/guix/drvs/wx//07bpmd11wpacmisfpxgxg3svv303yp-guix-package-cache.drv.bz2 25417
(repl-version 0 1 1)
Generating package cache for '/gnu/store/9digl6dpy00d6im5n7fj2nzxqhhkv7hc-profile'...
(values (value "/gnu/store/09ywndj14n3zj8j06z6gqj0kf2y9hmq5-guix-package-cache/lib/guix/package.cache"))
@ build-succeeded /gnu/store/wx07bpmd11wpacmisfpxgxg3svv303yp-guix-package-cache.drv -
@ build-started /gnu/store/80w9s5v6ig54w34j0jphvimb2xzgxm18-profile.drv - x86_64-linux /var/log/guix/drvs/80//w9s5v6ig54w34j0jphvimb2xzgxm18-profile.drv.bz2 25435
@ build-succeeded /gnu/store/80w9s5v6ig54w34j0jphvimb2xzgxm18-profile.drv -
debug: Finished building the channel derivation, took 26 seconds
debug: extract-information-from: /gnu/store/jhrndjkjanawiwhzgwdgpss8j53vkdgr-guix-181444fe3
debug: using open-inferior
guix repl: warning: 'nix-protocol-error?' is deprecated, use 'store-protocol-error?' instead
guix repl: warning: 'nix-protocol-error-message' is deprecated, use 'store-protocol-error-message' instead
debug: Starting building the glibc-locales derivation
debug: Finished building the glibc-locales derivation, took 0 seconds
debug: set GUIX_LOCPATH to /gnu/store/wff454axaqd5hd4xxhcagish4mj77dy7-glibc-locales-2.31/lib/locale:/gnu/store/9fgskzi20bfig3rxapgddsa26sspdsa1-glibc-utf8-locales-2.31/lib/locale
debug: using open-inferior
debug: Starting fetching inferior packages
debug: Finished fetching inferior packages, took 0 seconds
debug: Starting fetching inferior lint warnings
debug: Starting getting description lint warnings
guix repl: warning: 'nix-protocol-error?' is deprecated, use 'store-protocol-error?' instead
guix repl: warning: 'nix-protocol-error-message' is deprecated, use 'store-protocol-error-message' instead
debug: Finished getting description lint warnings, took 12 seconds
debug: Starting getting inputs-should-be-native lint warnings
guix repl: warning: 'nix-protocol-error?' is deprecated, use 'store-protocol-error?' instead
guix repl: warning: 'nix-protocol-error-message' is deprecated, use 'store-protocol-error-message' instead
debug: Finished getting inputs-should-be-native lint warnings, took 4 seconds
debug: Starting getting inputs-should-not-be-input lint warnings
guix repl: warning: 'nix-protocol-error?' is deprecated, use 'store-protocol-error?' instead
guix repl: warning: 'nix-protocol-error-message' is deprecated, use 'store-protocol-error-message' instead
debug: Finished getting inputs-should-not-be-input lint warnings, took 0 seconds
debug: Starting getting license lint warnings
guix repl: warning: 'nix-protocol-error?' is deprecated, use 'store-protocol-error?' instead
guix repl: warning: 'nix-protocol-error-message' is deprecated, use 'store-protocol-error-message' instead
debug: Finished getting license lint warnings, took 0 seconds
debug: Starting getting mirror-url lint warnings
guix repl: warning: 'nix-protocol-error?' is deprecated, use 'store-protocol-error?' instead
guix repl: warning: 'nix-protocol-error-message' is deprecated, use 'store-protocol-error-message' instead
debug: Finished getting mirror-url lint warnings, took 1 seconds
debug: Starting getting source-file-name lint warnings
guix repl: warning: 'nix-protocol-error?' is deprecated, use 'store-protocol-error?' instead
guix repl: warning: 'nix-protocol-error-message' is deprecated, use 'store-protocol-error-message' instead
debug: Finished getting source-file-name lint warnings, took 1 seconds
debug: Starting getting source-unstable-tarball lint warnings
guix repl: warning: 'nix-protocol-error?' is deprecated, use 'store-protocol-error?' instead
guix repl: warning: 'nix-protocol-error-message' is deprecated, use 'store-protocol-error-message' instead
debug: Finished getting source-unstable-tarball lint warnings, took 4 seconds
debug: Starting getting derivation lint warnings
guix repl: warning: 'nix-protocol-error?' is deprecated, use 'store-protocol-error?' instead
guix repl: warning: 'nix-protocol-error-message' is deprecated, use 'store-protocol-error-message' instead
debug: Finished getting derivation lint warnings, took 696 seconds
debug: Starting getting profile-collisions lint warnings
guix repl: warning: 'nix-protocol-error?' is deprecated, use 'store-protocol-error?' instead
guix repl: warning: 'nix-protocol-error-message' is deprecated, use 'store-protocol-error-message' instead
debug: Finished getting profile-collisions lint warnings, took 46 seconds
debug: Starting getting patch-file-names lint warnings
guix repl: warning: 'nix-protocol-error?' is deprecated, use 'store-protocol-error?' instead
guix repl: warning: 'nix-protocol-error-message' is deprecated, use 'store-protocol-error-message' instead
debug: Finished getting patch-file-names lint warnings, took 2 seconds
debug: Starting getting patch-headers lint warnings
guix repl: warning: 'nix-protocol-error?' is deprecated, use 'store-protocol-error?' instead
guix repl: warning: 'nix-protocol-error-message' is deprecated, use 'store-protocol-error-message' instead
debug: Finished getting patch-headers lint warnings, took 0 seconds
debug: Starting getting formatting lint warnings
guix repl: warning: 'nix-protocol-error?' is deprecated, use 'store-protocol-error?' instead
guix repl: warning: 'nix-protocol-error-message' is deprecated, use 'store-protocol-error-message' instead
debug: Finished getting formatting lint warnings, took 230 seconds
debug: Finished fetching inferior lint warnings, took 997 seconds
debug: Starting getting inferior derivations
heap size: 53.0 MiB
debug: Starting getting derivations for ((x86_64-linux . #f))
guix repl: warning: 'nix-protocol-error?' is deprecated, use 'store-protocol-error?' instead
guix repl: warning: 'nix-protocol-error-message' is deprecated, use 'store-protocol-error-message' instead
warning: request for x86_64-linux derivation for wine-staging produced a derivation for system i686-linux
warning: request for x86_64-linux derivation for wine-minimal produced a derivation for system i686-linux
warning: request for x86_64-linux derivation for wine produced a derivation for system i686-linux
warning: request for x86_64-linux derivation for mes-minimal produced a derivation for system i686-linux
warning: request for x86_64-linux derivation for memtest86+ produced a derivation for system i686-linux
warning: request for x86_64-linux derivation for gens-gs produced a derivation for system i686-linux
warning: request for x86_64-linux derivation for dev86 produced a derivation for system i686-linux
warning: request for x86_64-linux derivation for ada-ed produced a derivation for system i686-linux
debug: Finished getting derivations for ((x86_64-linux . #f)), took 2 seconds
heap size: 56.0 MiB
debug: Starting getting derivations for ((i686-linux . #f))
guix repl: warning: 'nix-protocol-error?' is deprecated, use 'store-protocol-error?' instead
guix repl: warning: 'nix-protocol-error-message' is deprecated, use 'store-protocol-error-message' instead
debug: Finished getting derivations for ((i686-linux . #f)), took 3 seconds
heap size: 57.0 MiB
debug: Starting getting derivations for ((armhf-linux . #f))
guix repl: warning: 'nix-protocol-error?' is deprecated, use 'store-protocol-error?' instead
guix repl: warning: 'nix-protocol-error-message' is deprecated, use 'store-protocol-error-message' instead
warning: request for armhf-linux derivation for mes-minimal produced a derivation for system i686-linux
warning: request for armhf-linux derivation for memtest86+ produced a derivation for system i686-linux
warning: request for armhf-linux derivation for gens-gs produced a derivation for system i686-linux
warning: request for armhf-linux derivation for dev86 produced a derivation for system i686-linux
debug: Finished getting derivations for ((armhf-linux . #f)), took 3 seconds
heap size: 76.0 MiB
debug: Starting getting derivations for ((aarch64-linux . #f))
guix repl: warning: 'nix-protocol-error?' is deprecated, use 'store-protocol-error?' instead
guix repl: warning: 'nix-protocol-error-message' is deprecated, use 'store-protocol-error-message' instead
warning: request for aarch64-linux derivation for wine-staging produced a derivation for system armhf-linux
warning: request for aarch64-linux derivation for wine-minimal produced a derivation for system armhf-linux
warning: request for aarch64-linux derivation for wine produced a derivation for system armhf-linux
warning: request for aarch64-linux derivation for mes-minimal produced a derivation for system i686-linux
warning: request for aarch64-linux derivation for memtest86+ produced a derivation for system i686-linux
warning: request for aarch64-linux derivation for go produced a derivation for system armhf-linux
warning: request for aarch64-linux derivation for gens-gs produced a derivation for system i686-linux
warning: request for aarch64-linux derivation for dev86 produced a derivation for system i686-linux
warning: request for aarch64-linux derivation for ada-ed produced a derivation for system armhf-linux
debug: Finished getting derivations for ((aarch64-linux . #f)), took 4 seconds
heap size: 85.0 MiB
debug: Starting getting derivations for ((mips64el-linux . #f))
guix repl: warning: 'nix-protocol-error?' is deprecated, use 'store-protocol-error?' instead
guix repl: warning: 'nix-protocol-error-message' is deprecated, use 'store-protocol-error-message' instead
warning: request for mips64el-linux derivation for wine-staging produced a derivation for system i686-linux
warning: request for mips64el-linux derivation for wine-minimal produced a derivation for system i686-linux
warning: request for mips64el-linux derivation for wine produced a derivation for system i686-linux
warning: request for mips64el-linux derivation for mes-minimal produced a derivation for system i686-linux
warning: request for mips64el-linux derivation for memtest86+ produced a derivation for system i686-linux
warning: request for mips64el-linux derivation for gens-gs produced a derivation for system i686-linux
warning: request for mips64el-linux derivation for dev86 produced a derivation for system i686-linux
warning: request for mips64el-linux derivation for ada-ed produced a derivation for system i686-linux
debug: Finished getting derivations for ((mips64el-linux . #f)), took 5 seconds
heap size: 101.0 MiB
debug: Starting getting derivations for ((i586-gnu . #f))
guix repl: warning: 'nix-protocol-error?' is deprecated, use 'store-protocol-error?' instead
guix repl: warning: 'nix-protocol-error-message' is deprecated, use 'store-protocol-error-message' instead
warning: request for i586-gnu derivation for wine-staging produced a derivation for system i686-linux
warning: request for i586-gnu derivation for wine-minimal produced a derivation for system i686-linux
warning: request for i586-gnu derivation for wine produced a derivation for system i686-linux
warning: request for i586-gnu derivation for mes-minimal produced a derivation for system i686-linux
warning: request for i586-gnu derivation for memtest86+ produced a derivation for system i686-linux
warning: request for i586-gnu derivation for gens-gs produced a derivation for system i686-linux
warning: request for i586-gnu derivation for dev86 produced a derivation for system i686-linux
warning: request for i586-gnu derivation for ada-ed produced a derivation for system i686-linux
debug: Finished getting derivations for ((i586-gnu . #f)), took 7 seconds
heap size: 109.0 MiB
debug: Starting getting derivations for ((x86_64-linux . arm-linux-gnueabihf) (x86_64-linux . aarch64-linux-gnu) (x86_64-linux . powerpc-linux-gnu) (x86_64-linux . riscv64-linux-gnu) (x86_64-linux . i586-pc-gnu))
guix repl: warning: 'nix-protocol-error?' is deprecated, use 'store-protocol-error?' instead
guix repl: warning: 'nix-protocol-error-message' is deprecated, use 'store-protocol-error-message' instead
warning: request for x86_64-linux derivation for wine-minimal produced a derivation for system i686-linux
warning: request for x86_64-linux derivation for ada-ed produced a derivation for system i686-linux
warning: request for x86_64-linux derivation for ada-ed produced a derivation for system i686-linux
debug: Finished getting derivations for ((x86_64-linux . arm-linux-gnueabihf) (x86_64-linux . aarch64-linux-gnu) (x86_64-linux . powerpc-linux-gnu) (x86_64-linux . riscv64-linux-gnu) (x86_64-linux . i586-pc-gnu)), took 69 seconds
debug: Finished getting inferior derivations, took 94 seconds
debug: Starting getting inferior system tests
debug: Starting getting system tests
guix repl: warning: 'nix-protocol-error?' is deprecated, use 'store-protocol-error?' instead
guix repl: warning: 'nix-protocol-error-message' is deprecated, use 'store-protocol-error-message' instead
guix-data-service: computing derivation for mpd system test
guix-data-service: computing derivation for mcron system test
guix-data-service: computing derivation for basic system test
guix-data-service: computing derivation for nss-mdns system test
guix-data-service: computing derivation for halt system test
guix-data-service: computing derivation for cleanup system test
guix-data-service: computing derivation for cups system test
guix-data-service: computing derivation for postgresql system test
guix-data-service: computing derivation for mysql system test
guix-data-service: computing derivation for mongodb system test
guix-data-service: computing derivation for memcached system test
guix-data-service: computing derivation for elogind system test
guix-data-service: computing derivation for dicod system test
guix-data-service: computing derivation for docker-system system test
guix-data-service: computing derivation for docker system test
guix-data-service: computing derivation for ganeti-lxc system test
guix-data-service: computing derivation for ganeti-kvm system test
guix-data-service: computing derivation for guix-build-coordinator system test
guix-data-service: computing derivation for guix-data-service system test
guix-data-service: computing derivation for separate-home-os system test
guix-data-service: computing derivation for gui-installed-os-encrypted system test
guix-data-service: computing derivation for raid-root-os system test
guix-data-service: computing derivation for encrypted-root-not-boot-os system test
guix-data-service: computing derivation for btrfs-root-os system test
guix-data-service: computing derivation for separate-store-os system test
guix-data-service: computing derivation for encrypted-root-os system test
guix-data-service: computing derivation for iso-image-installer system test
guix-data-service: computing derivation for lvm-separate-home-os system test
guix-data-service: computing derivation for jfs-root-os system test
guix-data-service: computing derivation for installed-extlinux-os system test
guix-data-service: computing derivation for f2fs-root-os system test
guix-data-service: computing derivation for gui-installed-desktop-os-encrypted system test
guix-data-service: computing derivation for installed-os system test
guix-data-service: computing derivation for gui-installed-os system test
guix-data-service: computing derivation for btrfs-root-on-subvolume-os system test
guix-data-service: computing derivation for ldap system test
guix-data-service: computing derivation for loadable-kernel-modules-2 system test
guix-data-service: computing derivation for loadable-kernel-modules-1 system test
guix-data-service: computing derivation for loadable-kernel-modules-0 system test
guix-data-service: computing derivation for opensmtpd system test
guix-data-service: computing derivation for exim system test
guix-data-service: computing derivation for dovecot system test
guix-data-service: computing derivation for getmail system test
guix repl: warning: the following accounts appear more than once: alice
guix repl: warning: the following accounts appear more than once: alice
guix repl: warning: the following accounts appear more than once: alice
guix repl: warning: the following accounts appear more than once: alice
guix repl: warning: the following accounts appear more than once: alice
guix repl: warning: the following accounts appear more than once: alice
guix-data-service: computing derivation for quassel system test
guix-data-service: computing derivation for prosody system test
guix-data-service: computing derivation for bitlbee system test
guix-data-service: computing derivation for zabbix system test
guix repl: warning: the following accounts appear more than once: zabbix
guix repl: warning: the following groups appear more than once: zabbix
hint: gnu/tests/monitoring.scm:314:19: zabbix-front-end-configuration: Consider using `db-secret-file' instead of `db-password' for better security.

guix repl: warning: the following accounts appear more than once: zabbix
guix repl: warning: the following groups appear more than once: zabbix
hint: gnu/tests/monitoring.scm:314:19: zabbix-front-end-configuration: Consider using `db-secret-file' instead of `db-password' for better security.

guix repl: warning: the following accounts appear more than once: zabbix
guix repl: warning: the following groups appear more than once: zabbix
hint: gnu/tests/monitoring.scm:314:19: zabbix-front-end-configuration: Consider using `db-secret-file' instead of `db-password' for better security.

guix repl: warning: the following accounts appear more than once: zabbix
guix repl: warning: the following groups appear more than once: zabbix
hint: gnu/tests/monitoring.scm:314:19: zabbix-front-end-configuration: Consider using `db-secret-file' instead of `db-password' for better security.

guix repl: warning: the following accounts appear more than once: zabbix
guix repl: warning: the following groups appear more than once: zabbix
hint: gnu/tests/monitoring.scm:314:19: zabbix-front-end-configuration: Consider using `db-secret-file' instead of `db-password' for better security.

guix repl: warning: the following accounts appear more than once: zabbix
guix repl: warning: the following groups appear more than once: zabbix
hint: gnu/tests/monitoring.scm:314:19: zabbix-front-end-configuration: Consider using `db-secret-file' instead of `db-password' for better security.

guix-data-service: computing derivation for prometheus-node-exporter system test
guix-data-service: computing derivation for dhcpd system test
guix-data-service: computing derivation for tor system test
guix-data-service: computing derivation for inetd system test
guix-data-service: computing derivation for openvswitch system test
guix-data-service: computing derivation for iptables system test
guix-data-service: computing derivation for nfs-server system test
guix-data-service: computing derivation for nfs system test
guix-data-service: computing derivation for nfs-root-fs system test
guix-data-service: computing derivation for nix system test
guix-data-service: computing derivation for install-bootloader system test
guix-data-service: computing derivation for upgrade-services system test
guix-data-service: computing derivation for switch-to-system system test
guix-data-service: computing derivation for rsync system test
guix-data-service: computing derivation for pcscd system test
guix-data-service: computing derivation for singularity system test
guix-data-service: computing derivation for dropbear system test
guix-data-service: computing derivation for openssh system test
guix-data-service: computing derivation for cgit system test
guix-data-service: computing derivation for git-http system test
guix-data-service: computing derivation for gitolite system test
guix-data-service: computing derivation for libvirt system test
guix-data-service: computing derivation for childhurd system test
guix-data-service: computing derivation for varnish system test
guix-data-service: computing derivation for patchwork system test
guix repl: warning: the following accounts appear more than once: httpd
guix repl: warning: the following accounts appear more than once: httpd
guix repl: warning: the following accounts appear more than once: httpd
guix repl: warning: the following accounts appear more than once: httpd
guix repl: warning: the following accounts appear more than once: httpd
guix repl: warning: the following accounts appear more than once: httpd
guix-data-service: computing derivation for nginx system test
guix-data-service: computing derivation for httpd system test
guix-data-service: computing derivation for hpcguix-web system test
guix-data-service: computing derivation for tailon system test
guix-data-service: computing derivation for php-fpm system test
debug: Finished getting system tests, took 185 seconds
debug: Finished getting inferior system tests, took 185 seconds
debug: Starting acquiring advisory transaction lock: load-new-guix-revision-inserts
debug: Finished acquiring advisory transaction lock: load-new-guix-revision-inserts, took 0 seconds
debug: Starting fetching inferior package license metadata
debug: Finished fetching inferior package license metadata, took 6 seconds
debug: Starting fetching inferior package metadata
debug: Starting populating temp_package_metadata
debug: Finished populating temp_package_metadata, took 0 seconds
debug: Starting querying the temp_package_metadata
debug: Finished querying the temp_package_metadata, took 1234 seconds
debug: Finished fetching inferior package metadata, took 1624 seconds
debug: Starting getting package-ids
debug: Finished getting package-ids, took 1 seconds
debug: finished loading information from inferior
debug: derivation-file-names->derivation-ids: processing 6 derivations
debug: derivation-file-names->vhash: 6 file-names
debug: derivation-file-names->vhash: lookup 6 file-names, 6 not cached
debug: derivation-file-names->vhash: adding 6 entries to the cache
debug: derivation-file-names->derivation-ids: processing 6 derivations
debug: derivation-file-names->vhash: 6 file-names
debug: derivation-file-names->vhash: lookup 6 file-names, 6 not cached
debug: derivation-file-names->vhash: adding 6 entries to the cache
debug: derivation-file-names->derivation-ids: processing 6 derivations
debug: derivation-file-names->vhash: 6 file-names
debug: derivation-file-names->vhash: lookup 6 file-names, 6 not cached
debug: derivation-file-names->vhash: adding 6 entries to the cache
debug: derivation-file-names->derivation-ids: processing 6 derivations
debug: derivation-file-names->vhash: 6 file-names
debug: derivation-file-names->vhash: lookup 6 file-names, 6 not cached
debug: derivation-file-names->vhash: adding 6 entries to the cache
debug: derivation-file-names->derivation-ids: processing 6 derivations
debug: derivation-file-names->vhash: 6 file-names
debug: derivation-file-names->vhash: lookup 6 file-names, 6 not cached
debug: derivation-file-names->vhash: adding 6 entries to the cache
debug: derivation-file-names->derivation-ids: processing 6 derivations
debug: derivation-file-names->vhash: 6 file-names
debug: derivation-file-names->vhash: lookup 6 file-names, 6 not cached
debug: derivation-file-names->vhash: adding 6 entries to the cache
debug: derivation-file-names->derivation-ids: processing 6 derivations
debug: derivation-file-names->vhash: 6 file-names
debug: derivation-file-names->vhash: lookup 6 file-names, 6 not cached
debug: derivation-file-names->vhash: adding 6 entries to the cache
debug: derivation-file-names->derivation-ids: processing 6 derivations
debug: derivation-file-names->vhash: 6 file-names
debug: derivation-file-names->vhash: lookup 6 file-names, 6 not cached
debug: derivation-file-names->vhash: adding 6 entries to the cache
debug: derivation-file-names->derivation-ids: processing 6 derivations
debug: derivation-file-names->vhash: 6 file-names
debug: derivation-file-names->vhash: lookup 6 file-names, 6 not cached
debug: derivation-file-names->vhash: adding 6 entries to the cache
debug: derivation-file-names->derivation-ids: processing 6 derivations
debug: derivation-file-names->vhash: 6 file-names
debug: derivation-file-names->vhash: lookup 6 file-names, 6 not cached
debug: derivation-file-names->vhash: adding 6 entries to the cache
debug: derivation-file-names->derivation-ids: processing 6 derivations
debug: derivation-file-names->vhash: 6 file-names
debug: derivation-file-names->vhash: lookup 6 file-names, 6 not cached
debug: derivation-file-names->vhash: adding 6 entries to the cache
debug: derivation-file-names->derivation-ids: processing 6 derivations
debug: derivation-file-names->vhash: 6 file-names
debug: derivation-file-names->vhash: lookup 6 file-names, 6 not cached
debug: derivation-file-names->vhash: adding 6 entries to the cache
debug: derivation-file-names->derivation-ids: processing 6 derivations
debug: derivation-file-names->vhash: 6 file-names
debug: derivation-file-names->vhash: lookup 6 file-names, 6 not cached
debug: derivation-file-names->vhash: adding 6 entries to the cache
debug: derivation-file-names->derivation-ids: processing 6 derivations
debug: derivation-file-names->vhash: 6 file-names
debug: derivation-file-names->vhash: lookup 6 file-names, 6 not cached
debug: derivation-file-names->vhash: adding 6 entries to the cache
debug: derivation-file-names->derivation-ids: processing 6 derivations
debug: derivation-file-names->vhash: 6 file-names
debug: derivation-file-names->vhash: lookup 6 file-names, 6 not cached
debug: derivation-file-names->vhash: adding 6 entries to the cache
debug: derivation-file-names->derivation-ids: processing 6 derivations
debug: derivation-file-names->vhash: 6 file-names
debug: derivation-file-names->vhash: lookup 6 file-names, 6 not cached
debug: derivation-file-names->vhash: adding 6 entries to the cache
debug: derivation-file-names->derivation-ids: processing 6 derivations
debug: derivation-file-names->vhash: 6 file-names
debug: derivation-file-names->vhash: lookup 6 file-names, 6 not cached
debug: derivation-file-names->vhash: adding 6 entries to the cache
debug: derivation-file-names->derivation-ids: processing 6 derivations
debug: derivation-file-names->vhash: 6 file-names
debug: derivation-file-names->vhash: lookup 6 file-names, 6 not cached
debug: derivation-file-names->vhash: adding 6 entries to the cache
debug: derivation-file-names->derivation-ids: processing 6 derivations
debug: derivation-file-names->vhash: 6 file-names
debug: derivation-file-names->vhash: lookup 6 file-names, 6 not cached
debug: derivation-file-names->vhash: adding 6 entries to the cache
debug: derivation-file-names->derivation-ids: processing 6 derivations
debug: derivation-file-names->vhash: 6 file-names
debug: derivation-file-names->vhash: lookup 6 file-names, 6 not cached
debug: derivation-file-names->vhash: adding 0 entries to the cache
debug: insert-missing-derivations: inserting 6 derivations
debug: insert-missing-derivations: updating hash table
debug: insert-missing-derivations: inserting outputs
debug: insert-missing-derivations: inserting sources
debug: insert-missing-derivations: ensure-input-derivations-exist
debug: ensure-input-derivations-exist: processing 144 derivations
debug: derivation-file-names->vhash: 144 file-names
debug: derivation-file-names->vhash: lookup 144 file-names, 144 not cached
debug: derivation-file-names->vhash: adding 138 entries to the cache
debug: ensure-input-derivations-exist: checking for missing input derivations
debug: insert-missing-derivations: inserting 6 derivations
debug: insert-missing-derivations: updating hash table
debug: insert-missing-derivations: inserting outputs
debug: insert-missing-derivations: inserting sources
debug: insert-missing-derivations: ensure-input-derivations-exist
debug: ensure-input-derivations-exist: processing 24 derivations
debug: derivation-file-names->vhash: 24 file-names
debug: derivation-file-names->vhash: lookup 24 file-names, 12 not cached
debug: derivation-file-names->vhash: adding 6 entries to the cache
debug: ensure-input-derivations-exist: checking for missing input derivations
debug: insert-missing-derivations: inserting 6 derivations
debug: insert-missing-derivations: updating hash table
debug: insert-missing-derivations: inserting outputs
debug: insert-missing-derivations: inserting sources
debug: insert-missing-derivations: ensure-input-derivations-exist
debug: ensure-input-derivations-exist: processing 66 derivations
debug: derivation-file-names->vhash: 66 file-names
debug: derivation-file-names->vhash: lookup 66 file-names, 36 not cached
debug: derivation-file-names->vhash: adding 30 entries to the cache
debug: ensure-input-derivations-exist: checking for missing input derivations
debug: insert-missing-derivations: inserting 6 derivations
debug: insert-missing-derivations: updating hash table
debug: insert-missing-derivations: inserting outputs
debug: insert-missing-derivations: inserting sources
debug: insert-missing-derivations: ensure-input-derivations-exist
debug: ensure-input-derivations-exist: processing 18 derivations
debug: derivation-file-names->vhash: 18 file-names
debug: derivation-file-names->vhash: lookup 18 file-names, 12 not cached
debug: derivation-file-names->vhash: adding 0 entries to the cache
debug: ensure-input-derivations-exist: checking for missing input derivations
debug: insert-missing-derivations: inserting 12 derivations
debug: insert-missing-derivations: updating hash table
debug: insert-missing-derivations: inserting outputs
debug: insert-missing-derivations: inserting sources
debug: insert-missing-derivations: ensure-input-derivations-exist
debug: ensure-input-derivations-exist: processing 84 derivations
debug: derivation-file-names->vhash: 84 file-names
debug: derivation-file-names->vhash: lookup 84 file-names, 48 not cached
debug: derivation-file-names->vhash: adding 36 entries to the cache
debug: ensure-input-derivations-exist: checking for missing input derivations
debug: insert-missing-derivations: inserting 12 derivations
debug: insert-missing-derivations: updating hash table
debug: insert-missing-derivations: inserting outputs
debug: insert-missing-derivations: inserting sources
debug: insert-missing-derivations: ensure-input-derivations-exist
debug: ensure-input-derivations-exist: processing 84 derivations
debug: derivation-file-names->vhash: 84 file-names
debug: derivation-file-names->vhash: lookup 84 file-names, 72 not cached
debug: derivation-file-names->vhash: adding 60 entries to the cache
debug: ensure-input-derivations-exist: checking for missing input derivations
debug: insert-missing-derivations: inserting 12 derivations
debug: insert-missing-derivations: updating hash table
debug: insert-missing-derivations: inserting outputs
debug: insert-missing-derivations: inserting sources
debug: insert-missing-derivations: ensure-input-derivations-exist
debug: ensure-input-derivations-exist: processing 588 derivations
debug: derivation-file-names->vhash: 588 file-names
debug: derivation-file-names->vhash: lookup 588 file-names, 438 not cached
debug: derivation-file-names->vhash: adding 378 entries to the cache
debug: ensure-input-derivations-exist: checking for missing input derivations
debug: insert-missing-derivations: inserting 60 derivations
debug: insert-missing-derivations: updating hash table
debug: insert-missing-derivations: inserting outputs
debug: insert-missing-derivations: inserting sources
debug: insert-missing-derivations: ensure-input-derivations-exist
debug: ensure-input-derivations-exist: processing 1123 derivations
debug: derivation-file-names->vhash: 1123 file-names
debug: derivation-file-names->vhash: lookup 1123 file-names, 589 not cached
debug: derivation-file-names->vhash: adding 577 entries to the cache
debug: ensure-input-derivations-exist: checking for missing input derivations
debug: insert-missing-derivations: inserting 12 derivations
debug: insert-missing-derivations: updating hash table
debug: insert-missing-derivations: inserting outputs
debug: insert-missing-derivations: inserting sources
debug: insert-missing-derivations: ensure-input-derivations-exist
debug: ensure-input-derivations-exist: processing 42 derivations
debug: derivation-file-names->vhash: 42 file-names
debug: derivation-file-names->vhash: lookup 42 file-names, 12 not cached
debug: derivation-file-names->vhash: adding 6 entries to the cache
debug: ensure-input-derivations-exist: checking for missing input derivations
debug: insert-missing-derivations: inserting 6 derivations
debug: insert-missing-derivations: updating hash table
debug: insert-missing-derivations: inserting outputs
debug: insert-missing-derivations: inserting sources
debug: insert-missing-derivations: ensure-input-derivations-exist
debug: ensure-input-derivations-exist: processing 30 derivations
debug: derivation-file-names->vhash: 30 file-names
debug: derivation-file-names->vhash: lookup 30 file-names, 12 not cached
debug: derivation-file-names->vhash: adding 12 entries to the cache
debug: ensure-input-derivations-exist: checking for missing input derivations
debug: insert-missing-derivations: inserting inputs
debug: insert-missing-derivations: inserting inputs
debug: insert-missing-derivations: inserting inputs
debug: insert-missing-derivations: inserting inputs
debug: insert-missing-derivations: inserting inputs
debug: insert-missing-derivations: inserting inputs
debug: insert-missing-derivations: inserting inputs
debug: insert-missing-derivations: inserting inputs
debug: insert-missing-derivations: inserting inputs
debug: insert-missing-derivations: inserting inputs
debug: derivation-file-names->derivation-ids: processing 6 derivations
debug: derivation-file-names->vhash: 6 file-names
debug: derivation-file-names->vhash: lookup 6 file-names, 6 not cached
debug: derivation-file-names->vhash: adding 0 entries to the cache
debug: insert-missing-derivations: inserting 6 derivations
debug: insert-missing-derivations: updating hash table
debug: insert-missing-derivations: inserting outputs
debug: insert-missing-derivations: inserting sources
debug: insert-missing-derivations: ensure-input-derivations-exist
debug: ensure-input-derivations-exist: processing 144 derivations
debug: derivation-file-names->vhash: 144 file-names
debug: derivation-file-names->vhash: lookup 144 file-names, 144 not cached
debug: derivation-file-names->vhash: adding 138 entries to the cache
debug: ensure-input-derivations-exist: checking for missing input derivations
debug: insert-missing-derivations: inserting 6 derivations
debug: insert-missing-derivations: updating hash table
debug: insert-missing-derivations: inserting outputs
debug: insert-missing-derivations: inserting sources
debug: insert-missing-derivations: ensure-input-derivations-exist
debug: ensure-input-derivations-exist: processing 30 derivations
debug: derivation-file-names->vhash: 30 file-names
debug: derivation-file-names->vhash: lookup 30 file-names, 18 not cached
debug: derivation-file-names->vhash: adding 12 entries to the cache
debug: ensure-input-derivations-exist: checking for missing input derivations
debug: insert-missing-derivations: inserting 6 derivations
debug: insert-missing-derivations: updating hash table
debug: insert-missing-derivations: inserting outputs
debug: insert-missing-derivations: inserting sources
debug: insert-missing-derivations: ensure-input-derivations-exist
debug: ensure-input-derivations-exist: processing 108 derivations
debug: derivation-file-names->vhash: 108 file-names
debug: derivation-file-names->vhash: lookup 108 file-names, 84 not cached
debug: derivation-file-names->vhash: adding 72 entries to the cache
debug: ensure-input-derivations-exist: checking for missing input derivations
debug: insert-missing-derivations: inserting 12 derivations
debug: insert-missing-derivations: updating hash table
debug: insert-missing-derivations: inserting outputs
debug: insert-missing-derivations: inserting sources
debug: insert-missing-derivations: ensure-input-derivations-exist
debug: ensure-input-derivations-exist: processing 84 derivations
debug: derivation-file-names->vhash: 84 file-names
debug: derivation-file-names->vhash: lookup 84 file-names, 72 not cached
debug: derivation-file-names->vhash: adding 60 entries to the cache
debug: ensure-input-derivations-exist: checking for missing input derivations
debug: insert-missing-derivations: inserting 12 derivations
debug: insert-missing-derivations: updating hash table
debug: insert-missing-derivations: inserting outputs
debug: insert-missing-derivations: inserting sources
debug: insert-missing-derivations: ensure-input-derivations-exist
debug: ensure-input-derivations-exist: processing 612 derivations
debug: derivation-file-names->vhash: 612 file-names
debug: derivation-file-names->vhash: lookup 612 file-names, 438 not cached
debug: derivation-file-names->vhash: adding 384 entries to the cache
debug: ensure-input-derivations-exist: checking for missing input derivations
debug: insert-missing-derivations: inserting 54 derivations
debug: insert-missing-derivations: updating hash table
debug: insert-missing-derivations: inserting outputs
debug: insert-missing-derivations: inserting sources
debug: insert-missing-derivations: ensure-input-derivations-exist
debug: ensure-input-derivations-exist: processing 930 derivations
debug: derivation-file-names->vhash: 930 file-names
debug: derivation-file-names->vhash: lookup 930 file-names, 372 not cached
debug: derivation-file-names->vhash: adding 372 entries to the cache
debug: ensure-input-derivations-exist: checking for missing input derivations
debug: insert-missing-derivations: inserting inputs
debug: insert-missing-derivations: inserting inputs
debug: insert-missing-derivations: inserting inputs
debug: insert-missing-derivations: inserting inputs
debug: insert-missing-derivations: inserting inputs
debug: insert-missing-derivations: inserting inputs
debug: derivation-file-names->derivation-ids: processing 6 derivations
debug: derivation-file-names->vhash: 6 file-names
debug: derivation-file-names->vhash: lookup 6 file-names, 6 not cached
debug: derivation-file-names->vhash: adding 0 entries to the cache
debug: insert-missing-derivations: inserting 6 derivations
debug: insert-missing-derivations: updating hash table
debug: insert-missing-derivations: inserting outputs
debug: insert-missing-derivations: inserting sources
debug: insert-missing-derivations: ensure-input-derivations-exist
debug: ensure-input-derivations-exist: processing 144 derivations
debug: derivation-file-names->vhash: 144 file-names
debug: derivation-file-names->vhash: lookup 144 file-names, 144 not cached
debug: derivation-file-names->vhash: adding 138 entries to the cache
debug: ensure-input-derivations-exist: checking for missing input derivations
debug: insert-missing-derivations: inserting 6 derivations
debug: insert-missing-derivations: updating hash table
debug: insert-missing-derivations: inserting outputs
debug: insert-missing-derivations: inserting sources
debug: insert-missing-derivations: ensure-input-derivations-exist
debug: ensure-input-derivations-exist: processing 24 derivations
debug: derivation-file-names->vhash: 24 file-names
debug: derivation-file-names->vhash: lookup 24 file-names, 12 not cached
debug: derivation-file-names->vhash: adding 6 entries to the cache
debug: ensure-input-derivations-exist: checking for missing input derivations
debug: insert-missing-derivations: inserting 6 derivations
debug: insert-missing-derivations: updating hash table
debug: insert-missing-derivations: inserting outputs
debug: insert-missing-derivations: inserting sources
debug: insert-missing-derivations: ensure-input-derivations-exist
debug: ensure-input-derivations-exist: processing 66 derivations
debug: derivation-file-names->vhash: 66 file-names
debug: derivation-file-names->vhash: lookup 66 file-names, 36 not cached
debug: derivation-file-names->vhash: adding 30 entries to the cache
debug: ensure-input-derivations-exist: checking for missing input derivations
debug: insert-missing-derivations: inserting 6 derivations
debug: insert-missing-derivations: updating hash table
debug: insert-missing-derivations: inserting outputs
debug: insert-missing-derivations: inserting sources
debug: insert-missing-derivations: ensure-input-derivations-exist
debug: ensure-input-derivations-exist: processing 18 derivations
debug: derivation-file-names->vhash: 18 file-names
debug: derivation-file-names->vhash: lookup 18 file-names, 12 not cached
debug: derivation-file-names->vhash: adding 0 entries to the cache
debug: ensure-input-derivations-exist: checking for missing input derivations
debug: insert-missing-derivations: inserting 12 derivations
debug: insert-missing-derivations: updating hash table
debug: insert-missing-derivations: inserting outputs
debug: insert-missing-derivations: inserting sources
debug: insert-missing-derivations: ensure-input-derivations-exist
debug: ensure-input-derivations-exist: processing 84 derivations
debug: derivation-file-names->vhash: 84 file-names
debug: derivation-file-names->vhash: lookup 84 file-names, 48 not cached
debug: derivation-file-names->vhash: adding 36 entries to the cache
debug: ensure-input-derivations-exist: checking for missing input derivations
debug: insert-missing-derivations: inserting 12 derivations
debug: insert-missing-derivations: updating hash table
debug: insert-missing-derivations: inserting outputs
debug: insert-missing-derivations: inserting sources
debug: insert-missing-derivations: ensure-input-derivations-exist
debug: ensure-input-derivations-exist: processing 84 derivations
debug: derivation-file-names->vhash: 84 file-names
debug: derivation-file-names->vhash: lookup 84 file-names, 72 not cached
debug: derivation-file-names->vhash: adding 72 entries to the cache
debug: ensure-input-derivations-exist: checking for missing input derivations
debug: insert-missing-derivations: inserting inputs
debug: insert-missing-derivations: inserting inputs
debug: insert-missing-derivations: inserting inputs
debug: insert-missing-derivations: inserting inputs
debug: insert-missing-derivations: inserting inputs
debug: insert-missing-derivations: inserting inputs
debug: derivation-file-names->derivation-ids: processing 6 derivations
debug: derivation-file-names->vhash: 6 file-names
debug: derivation-file-names->vhash: lookup 6 file-names, 6 not cached
debug: derivation-file-names->vhash: adding 0 entries to the cache
debug: insert-missing-derivations: inserting 6 derivations
debug: insert-missing-derivations: updating hash table
debug: insert-missing-derivations: inserting outputs
debug: insert-missing-derivations: inserting sources
debug: insert-missing-derivations: ensure-input-derivations-exist
debug: ensure-input-derivations-exist: processing 144 derivations
debug: derivation-file-names->vhash: 144 file-names
debug: derivation-file-names->vhash: lookup 144 file-names, 144 not cached
debug: derivation-file-names->vhash: adding 138 entries to the cache
debug: ensure-input-derivations-exist: checking for missing input derivations
debug: insert-missing-derivations: inserting 6 derivations
debug: insert-missing-derivations: updating hash table
debug: insert-missing-derivations: inserting outputs
debug: insert-missing-derivations: inserting sources
debug: insert-missing-derivations: ensure-input-derivations-exist
debug: ensure-input-derivations-exist: processing 24 derivations
debug: derivation-file-names->vhash: 24 file-names
debug: derivation-file-names->vhash: lookup 24 file-names, 12 not cached
debug: derivation-file-names->vhash: adding 6 entries to the cache
debug: ensure-input-derivations-exist: checking for missing input derivations
debug: insert-missing-derivations: inserting 6 derivations
debug: insert-missing-derivations: updating hash table
debug: insert-missing-derivations: inserting outputs
debug: insert-missing-derivations: inserting sources
debug: insert-missing-derivations: ensure-input-derivations-exist
debug: ensure-input-derivations-exist: processing 66 derivations
debug: derivation-file-names->vhash: 66 file-names
debug: derivation-file-names->vhash: lookup 66 file-names, 36 not cached
debug: derivation-file-names->vhash: adding 30 entries to the cache
debug: ensure-input-derivations-exist: checking for missing input derivations
debug: insert-missing-derivations: inserting 6 derivations
debug: insert-missing-derivations: updating hash table
debug: insert-missing-derivations: inserting outputs
debug: insert-missing-derivations: inserting sources
debug: insert-missing-derivations: ensure-input-derivations-exist
debug: ensure-input-derivations-exist: processing 18 derivations
debug: derivation-file-names->vhash: 18 file-names
debug: derivation-file-names->vhash: lookup 18 file-names, 12 not cached
debug: derivation-file-names->vhash: adding 0 entries to the cache
debug: ensure-input-derivations-exist: checking for missing input derivations
debug: insert-missing-derivations: inserting 12 derivations
debug: insert-missing-derivations: updating hash table
debug: insert-missing-derivations: inserting outputs
debug: insert-missing-derivations: inserting sources
debug: insert-missing-derivations: ensure-input-derivations-exist
debug: ensure-input-derivations-exist: processing 84 derivations
debug: derivation-file-names->vhash: 84 file-names
debug: derivation-file-names->vhash: lookup 84 file-names, 48 not cached
debug: derivation-file-names->vhash: adding 36 entries to the cache
debug: ensure-input-derivations-exist: checking for missing input derivations
debug: insert-missing-derivations: inserting 12 derivations
debug: insert-missing-derivations: updating hash table
debug: insert-missing-derivations: inserting outputs
debug: insert-missing-derivations: inserting sources
debug: insert-missing-derivations: ensure-input-derivations-exist
debug: ensure-input-derivations-exist: processing 84 derivations
debug: derivation-file-names->vhash: 84 file-names
debug: derivation-file-names->vhash: lookup 84 file-names, 72 not cached
debug: derivation-file-names->vhash: adding 72 entries to the cache
debug: ensure-input-derivations-exist: checking for missing input derivations
debug: insert-missing-derivations: inserting inputs
debug: insert-missing-derivations: inserting inputs
debug: insert-missing-derivations: inserting inputs
debug: insert-missing-derivations: inserting inputs
debug: insert-missing-derivations: inserting inputs
debug: insert-missing-derivations: inserting inputs
debug: derivation-file-names->derivation-ids: processing 6 derivations
debug: derivation-file-names->vhash: 6 file-names
debug: derivation-file-names->vhash: lookup 6 file-names, 6 not cached
debug: derivation-file-names->vhash: adding 0 entries to the cache
debug: insert-missing-derivations: inserting 6 derivations
debug: insert-missing-derivations: updating hash table
debug: insert-missing-derivations: inserting outputs
debug: insert-missing-derivations: inserting sources
debug: insert-missing-derivations: ensure-input-derivations-exist
debug: ensure-input-derivations-exist: processing 144 derivations
debug: derivation-file-names->vhash: 144 file-names
debug: derivation-file-names->vhash: lookup 144 file-names, 144 not cached
debug: derivation-file-names->vhash: adding 138 entries to the cache
debug: ensure-input-derivations-exist: checking for missing input derivations
debug: insert-missing-derivations: inserting 6 derivations
debug: insert-missing-derivations: updating hash table
debug: insert-missing-derivations: inserting outputs
debug: insert-missing-derivations: inserting sources
debug: insert-missing-derivations: ensure-input-derivations-exist
debug: ensure-input-derivations-exist: processing 24 derivations
debug: derivation-file-names->vhash: 24 file-names
debug: derivation-file-names->vhash: lookup 24 file-names, 12 not cached
debug: derivation-file-names->vhash: adding 6 entries to the cache
debug: ensure-input-derivations-exist: checking for missing input derivations
debug: insert-missing-derivations: inserting 6 derivations
debug: insert-missing-derivations: updating hash table
debug: insert-missing-derivations: inserting outputs
debug: insert-missing-derivations: inserting sources
debug: insert-missing-derivations: ensure-input-derivations-exist
debug: ensure-input-derivations-exist: processing 66 derivations
debug: derivation-file-names->vhash: 66 file-names
debug: derivation-file-names->vhash: lookup 66 file-names, 36 not cached
debug: derivation-file-names->vhash: adding 30 entries to the cache
debug: ensure-input-derivations-exist: checking for missing input derivations
debug: insert-missing-derivations: inserting 6 derivations
debug: insert-missing-derivations: updating hash table
debug: insert-missing-derivations: inserting outputs
debug: insert-missing-derivations: inserting sources
debug: insert-missing-derivations: ensure-input-derivations-exist
debug: ensure-input-derivations-exist: processing 18 derivations
debug: derivation-file-names->vhash: 18 file-names
debug: derivation-file-names->vhash: lookup 18 file-names, 12 not cached
debug: derivation-file-names->vhash: adding 0 entries to the cache
debug: ensure-input-derivations-exist: checking for missing input derivations
debug: insert-missing-derivations: inserting 12 derivations
debug: insert-missing-derivations: updating hash table
debug: insert-missing-derivations: inserting outputs
debug: insert-missing-derivations: inserting sources
debug: insert-missing-derivations: ensure-input-derivations-exist
debug: ensure-input-derivations-exist: processing 84 derivations
debug: derivation-file-names->vhash: 84 file-names
debug: derivation-file-names->vhash: lookup 84 file-names, 48 not cached
debug: derivation-file-names->vhash: adding 36 entries to the cache
debug: ensure-input-derivations-exist: checking for missing input derivations
debug: insert-missing-derivations: inserting 12 derivations
debug: insert-missing-derivations: updating hash table
debug: insert-missing-derivations: inserting outputs
debug: insert-missing-derivations: inserting sources
debug: insert-missing-derivations: ensure-input-derivations-exist
debug: ensure-input-derivations-exist: processing 84 derivations
debug: derivation-file-names->vhash: 84 file-names
debug: derivation-file-names->vhash: lookup 84 file-names, 72 not cached
debug: derivation-file-names->vhash: adding 72 entries to the cache
debug: ensure-input-derivations-exist: checking for missing input derivations
debug: insert-missing-derivations: inserting inputs
debug: insert-missing-derivations: inserting inputs
debug: insert-missing-derivations: inserting inputs
debug: insert-missing-derivations: inserting inputs
debug: insert-missing-derivations: inserting inputs
debug: insert-missing-derivations: inserting inputs
debug: derivation-file-names->derivation-ids: processing 6 derivations
debug: derivation-file-names->vhash: 6 file-names
debug: derivation-file-names->vhash: lookup 6 file-names, 6 not cached
debug: derivation-file-names->vhash: adding 0 entries to the cache
debug: insert-missing-derivations: inserting 6 derivations
debug: insert-missing-derivations: updating hash table
debug: insert-missing-derivations: inserting outputs
debug: insert-missing-derivations: inserting sources
debug: insert-missing-derivations: ensure-input-derivations-exist
debug: ensure-input-derivations-exist: processing 144 derivations
debug: derivation-file-names->vhash: 144 file-names
debug: derivation-file-names->vhash: lookup 144 file-names, 144 not cached
debug: derivation-file-names->vhash: adding 138 entries to the cache
debug: ensure-input-derivations-exist: checking for missing input derivations
debug: insert-missing-derivations: inserting 6 derivations
debug: insert-missing-derivations: updating hash table
debug: insert-missing-derivations: inserting outputs
debug: insert-missing-derivations: inserting sources
debug: insert-missing-derivations: ensure-input-derivations-exist
debug: ensure-input-derivations-exist: processing 24 derivations
debug: derivation-file-names->vhash: 24 file-names
debug: derivation-file-names->vhash: lookup 24 file-names, 12 not cached
debug: derivation-file-names->vhash: adding 6 entries to the cache
debug: ensure-input-derivations-exist: checking for missing input derivations
debug: insert-missing-derivations: inserting 6 derivations
debug: insert-missing-derivations: updating hash table
debug: insert-missing-derivations: inserting outputs
debug: insert-missing-derivations: inserting sources
debug: insert-missing-derivations: ensure-input-derivations-exist
debug: ensure-input-derivations-exist: processing 66 derivations
debug: derivation-file-names->vhash: 66 file-names
debug: derivation-file-names->vhash: lookup 66 file-names, 36 not cached
debug: derivation-file-names->vhash: adding 30 entries to the cache
debug: ensure-input-derivations-exist: checking for missing input derivations
debug: insert-missing-derivations: inserting 6 derivations
debug: insert-missing-derivations: updating hash table
debug: insert-missing-derivations: inserting outputs
debug: insert-missing-derivations: inserting sources
debug: insert-missing-derivations: ensure-input-derivations-exist
debug: ensure-input-derivations-exist: processing 18 derivations
debug: derivation-file-names->vhash: 18 file-names
debug: derivation-file-names->vhash: lookup 18 file-names, 12 not cached
debug: derivation-file-names->vhash: adding 0 entries to the cache
debug: ensure-input-derivations-exist: checking for missing input derivations
debug: insert-missing-derivations: inserting 12 derivations
debug: insert-missing-derivations: updating hash table
debug: insert-missing-derivations: inserting outputs
debug: insert-missing-derivations: inserting sources
debug: insert-missing-derivations: ensure-input-derivations-exist
debug: ensure-input-derivations-exist: processing 84 derivations
debug: derivation-file-names->vhash: 84 file-names
debug: derivation-file-names->vhash: lookup 84 file-names, 48 not cached
debug: derivation-file-names->vhash: adding 36 entries to the cache
debug: ensure-input-derivations-exist: checking for missing input derivations
debug: insert-missing-derivations: inserting 12 derivations
debug: insert-missing-derivations: updating hash table
debug: insert-missing-derivations: inserting outputs
debug: insert-missing-derivations: inserting sources
debug: insert-missing-derivations: ensure-input-derivations-exist
debug: ensure-input-derivations-exist: processing 84 derivations
debug: derivation-file-names->vhash: 84 file-names
debug: derivation-file-names->vhash: lookup 84 file-names, 72 not cached
debug: derivation-file-names->vhash: adding 72 entries to the cache
debug: ensure-input-derivations-exist: checking for missing input derivations
debug: insert-missing-derivations: inserting inputs
debug: insert-missing-derivations: inserting inputs
debug: insert-missing-derivations: inserting inputs
debug: insert-missing-derivations: inserting inputs
debug: insert-missing-derivations: inserting inputs
debug: insert-missing-derivations: inserting inputs
debug: derivation-file-names->derivation-ids: processing 6 derivations
debug: derivation-file-names->vhash: 6 file-names
debug: derivation-file-names->vhash: lookup 6 file-names, 6 not cached
debug: derivation-file-names->vhash: adding 0 entries to the cache
debug: insert-missing-derivations: inserting 6 derivations
debug: insert-missing-derivations: updating hash table
debug: insert-missing-derivations: inserting outputs
debug: insert-missing-derivations: inserting sources
debug: insert-missing-derivations: ensure-input-derivations-exist
debug: ensure-input-derivations-exist: processing 144 derivations
debug: derivation-file-names->vhash: 144 file-names
debug: derivation-file-names->vhash: lookup 144 file-names, 144 not cached
debug: derivation-file-names->vhash: adding 138 entries to the cache
debug: ensure-input-derivations-exist: checking for missing input derivations
debug: insert-missing-derivations: inserting 6 derivations
debug: insert-missing-derivations: updating hash table
debug: insert-missing-derivations: inserting outputs
debug: insert-missing-derivations: inserting sources
debug: insert-missing-derivations: ensure-input-derivations-exist
debug: ensure-input-derivations-exist: processing 24 derivations
debug: derivation-file-names->vhash: 24 file-names
debug: derivation-file-names->vhash: lookup 24 file-names, 12 not cached
debug: derivation-file-names->vhash: adding 6 entries to the cache
debug: ensure-input-derivations-exist: checking for missing input derivations
debug: insert-missing-derivations: inserting 6 derivations
debug: insert-missing-derivations: updating hash table
debug: insert-missing-derivations: inserting outputs
debug: insert-missing-derivations: inserting sources
debug: insert-missing-derivations: ensure-input-derivations-exist
debug: ensure-input-derivations-exist: processing 66 derivations
debug: derivation-file-names->vhash: 66 file-names
debug: derivation-file-names->vhash: lookup 66 file-names, 36 not cached
debug: derivation-file-names->vhash: adding 30 entries to the cache
debug: ensure-input-derivations-exist: checking for missing input derivations
debug: insert-missing-derivations: inserting 6 derivations
debug: insert-missing-derivations: updating hash table
debug: insert-missing-derivations: inserting outputs
debug: insert-missing-derivations: inserting sources
debug: insert-missing-derivations: ensure-input-derivations-exist
debug: ensure-input-derivations-exist: processing 18 derivations
debug: derivation-file-names->vhash: 18 file-names
debug: derivation-file-names->vhash: lookup 18 file-names, 12 not cached
debug: derivation-file-names->vhash: adding 0 entries to the cache
debug: ensure-input-derivations-exist: checking for missing input derivations
debug: insert-missing-derivations: inserting 12 derivations
debug: insert-missing-derivations: updating hash table
debug: insert-missing-derivations: inserting outputs
debug: insert-missing-derivations: inserting sources
debug: insert-missing-derivations: ensure-input-derivations-exist
debug: ensure-input-derivations-exist: processing 84 derivations
debug: derivation-file-names->vhash: 84 file-names
debug: derivation-file-names->vhash: lookup 84 file-names, 48 not cached
debug: derivation-file-names->vhash: adding 36 entries to the cache
debug: ensure-input-derivations-exist: checking for missing input derivations
debug: insert-missing-derivations: inserting 12 derivations
debug: insert-missing-derivations: updating hash table
debug: insert-missing-derivations: inserting outputs
debug: insert-missing-derivations: inserting sources
debug: insert-missing-derivations: ensure-input-derivations-exist
debug: ensure-input-derivations-exist: processing 84 derivations
debug: derivation-file-names->vhash: 84 file-names
debug: derivation-file-names->vhash: lookup 84 file-names, 72 not cached
debug: derivation-file-names->vhash: adding 72 entries to the cache
debug: ensure-input-derivations-exist: checking for missing input derivations
debug: insert-missing-derivations: inserting inputs
debug: insert-missing-derivations: inserting inputs
debug: insert-missing-derivations: inserting inputs
debug: insert-missing-derivations: inserting inputs
debug: insert-missing-derivations: inserting inputs
debug: insert-missing-derivations: inserting inputs
debug: derivation-file-names->derivation-ids: processing 6 derivations
debug: derivation-file-names->vhash: 6 file-names
debug: derivation-file-names->vhash: lookup 6 file-names, 6 not cached
debug: derivation-file-names->vhash: adding 0 entries to the cache
debug: insert-missing-derivations: inserting 6 derivations
debug: insert-missing-derivations: updating hash table
debug: insert-missing-derivations: inserting outputs
debug: insert-missing-derivations: inserting sources
debug: insert-missing-derivations: ensure-input-derivations-exist
debug: ensure-input-derivations-exist: processing 144 derivations
debug: derivation-file-names->vhash: 144 file-names
debug: derivation-file-names->vhash: lookup 144 file-names, 144 not cached
debug: derivation-file-names->vhash: adding 138 entries to the cache
debug: ensure-input-derivations-exist: checking for missing input derivations
debug: insert-missing-derivations: inserting 6 derivations
debug: insert-missing-derivations: updating hash table
debug: insert-missing-derivations: inserting outputs
debug: insert-missing-derivations: inserting sources
debug: insert-missing-derivations: ensure-input-derivations-exist
debug: ensure-input-derivations-exist: processing 24 derivations
debug: derivation-file-names->vhash: 24 file-names
debug: derivation-file-names->vhash: lookup 24 file-names, 12 not cached
debug: derivation-file-names->vhash: adding 6 entries to the cache
debug: ensure-input-derivations-exist: checking for missing input derivations
debug: insert-missing-derivations: inserting 6 derivations
debug: insert-missing-derivations: updating hash table
debug: insert-missing-derivations: inserting outputs
debug: insert-missing-derivations: inserting sources
debug: insert-missing-derivations: ensure-input-derivations-exist
debug: ensure-input-derivations-exist: processing 108 derivations
debug: derivation-file-names->vhash: 108 file-names
debug: derivation-file-names->vhash: lookup 108 file-names, 84 not cached
debug: derivation-file-names->vhash: adding 72 entries to the cache
debug: ensure-input-derivations-exist: checking for missing input derivations
debug: insert-missing-derivations: inserting 12 derivations
debug: insert-missing-derivations: updating hash table
debug: insert-missing-derivations: inserting outputs
debug: insert-missing-derivations: inserting sources
debug: insert-missing-derivations: ensure-input-derivations-exist
debug: ensure-input-derivations-exist: processing 84 derivations
debug: derivation-file-names->vhash: 84 file-names
debug: derivation-file-names->vhash: lookup 84 file-names, 72 not cached
debug: derivation-file-names->vhash: adding 66 entries to the cache
debug: ensure-input-derivations-exist: checking for missing input derivations
debug: insert-missing-derivations: inserting 6 derivations
debug: insert-missing-derivations: updating hash table
debug: insert-missing-derivations: inserting outputs
debug: insert-missing-derivations: inserting sources
debug: insert-missing-derivations: ensure-input-derivations-exist
debug: ensure-input-derivations-exist: processing 36 derivations
debug: derivation-file-names->vhash: 36 file-names
debug: derivation-file-names->vhash: lookup 36 file-names, 18 not cached
debug: derivation-file-names->vhash: adding 18 entries to the cache
debug: ensure-input-derivations-exist: checking for missing input derivations
debug: insert-missing-derivations: inserting inputs
debug: insert-missing-derivations: inserting inputs
debug: insert-missing-derivations: inserting inputs
debug: insert-missing-derivations: inserting inputs
debug: insert-missing-derivations: inserting inputs
debug: derivation-file-names->derivation-ids: processing 6 derivations
debug: derivation-file-names->vhash: 6 file-names
debug: derivation-file-names->vhash: lookup 6 file-names, 6 not cached
debug: derivation-file-names->vhash: adding 0 entries to the cache
debug: insert-missing-derivations: inserting 6 derivations
debug: insert-missing-derivations: updating hash table
debug: insert-missing-derivations: inserting outputs
debug: insert-missing-derivations: inserting sources
debug: insert-missing-derivations: ensure-input-derivations-exist
debug: ensure-input-derivations-exist: processing 144 derivations
debug: derivation-file-names->vhash: 144 file-names
debug: derivation-file-names->vhash: lookup 144 file-names, 144 not cached
debug: derivation-file-names->vhash: adding 138 entries to the cache
debug: ensure-input-derivations-exist: checking for missing input derivations
debug: insert-missing-derivations: inserting 6 derivations
debug: insert-missing-derivations: updating hash table
debug: insert-missing-derivations: inserting outputs
debug: insert-missing-derivations: inserting sources
debug: insert-missing-derivations: ensure-input-derivations-exist
debug: ensure-input-derivations-exist: processing 24 derivations
debug: derivation-file-names->vhash: 24 file-names
debug: derivation-file-names->vhash: lookup 24 file-names, 12 not cached
debug: derivation-file-names->vhash: adding 6 entries to the cache
debug: ensure-input-derivations-exist: checking for missing input derivations
debug: insert-missing-derivations: inserting 6 derivations
debug: insert-missing-derivations: updating hash table
debug: insert-missing-derivations: inserting outputs
debug: insert-missing-derivations: inserting sources
debug: insert-missing-derivations: ensure-input-derivations-exist
debug: ensure-input-derivations-exist: processing 66 derivations
debug: derivation-file-names->vhash: 66 file-names
debug: derivation-file-names->vhash: lookup 66 file-names, 36 not cached
debug: derivation-file-names->vhash: adding 30 entries to the cache
debug: ensure-input-derivations-exist: checking for missing input derivations
debug: insert-missing-derivations: inserting 6 derivations
debug: insert-missing-derivations: updating hash table
debug: insert-missing-derivations: inserting outputs
debug: insert-missing-derivations: inserting sources
debug: insert-missing-derivations: ensure-input-derivations-exist
debug: ensure-input-derivations-exist: processing 18 derivations
debug: derivation-file-names->vhash: 18 file-names
debug: derivation-file-names->vhash: lookup 18 file-names, 12 not cached
debug: derivation-file-names->vhash: adding 0 entries to the cache
debug: ensure-input-derivations-exist: checking for missing input derivations
debug: insert-missing-derivations: inserting 12 derivations
debug: insert-missing-derivations: updating hash table
debug: insert-missing-derivations: inserting outputs
debug: insert-missing-derivations: inserting sources
debug: insert-missing-derivations: ensure-input-derivations-exist
debug: ensure-input-derivations-exist: processing 84 derivations
debug: derivation-file-names->vhash: 84 file-names
debug: derivation-file-names->vhash: lookup 84 file-names, 48 not cached
debug: derivation-file-names->vhash: adding 36 entries to the cache
debug: ensure-input-derivations-exist: checking for missing input derivations
debug: insert-missing-derivations: inserting 12 derivations
debug: insert-missing-derivations: updating hash table
debug: insert-missing-derivations: inserting outputs
debug: insert-missing-derivations: inserting sources
debug: insert-missing-derivations: ensure-input-derivations-exist
debug: ensure-input-derivations-exist: processing 84 derivations
debug: derivation-file-names->vhash: 84 file-names
debug: derivation-file-names->vhash: lookup 84 file-names, 72 not cached
debug: derivation-file-names->vhash: adding 66 entries to the cache
debug: ensure-input-derivations-exist: checking for missing input derivations
debug: insert-missing-derivations: inserting 6 derivations
debug: insert-missing-derivations: updating hash table
debug: insert-missing-derivations: inserting outputs
debug: insert-missing-derivations: inserting sources
debug: insert-missing-derivations: ensure-input-derivations-exist
debug: ensure-input-derivations-exist: processing 576 derivations
debug: derivation-file-names->vhash: 576 file-names
debug: derivation-file-names->vhash: lookup 576 file-names, 432 not cached
debug: derivation-file-names->vhash: adding 390 entries to the cache
debug: ensure-input-derivations-exist: checking for missing input derivations
debug: insert-missing-derivations: inserting 42 derivations
debug: insert-missing-derivations: updating hash table
debug: insert-missing-derivations: inserting outputs
debug: insert-missing-derivations: inserting sources
debug: insert-missing-derivations: ensure-input-derivations-exist
debug: ensure-input-derivations-exist: processing 600 derivations
debug: derivation-file-names->vhash: 600 file-names
debug: derivation-file-names->vhash: lookup 600 file-names, 60 not cached
debug: derivation-file-names->vhash: adding 60 entries to the cache
debug: ensure-input-derivations-exist: checking for missing input derivations
debug: insert-missing-derivations: inserting inputs
debug: insert-missing-derivations: inserting inputs
debug: insert-missing-derivations: inserting inputs
debug: insert-missing-derivations: inserting inputs
debug: insert-missing-derivations: inserting inputs
debug: insert-missing-derivations: inserting inputs
debug: insert-missing-derivations: inserting inputs
debug: insert-missing-derivations: inserting inputs
debug: derivation-file-names->derivation-ids: processing 6 derivations
debug: derivation-file-names->vhash: 6 file-names
debug: derivation-file-names->vhash: lookup 6 file-names, 6 not cached
debug: derivation-file-names->vhash: adding 0 entries to the cache
debug: insert-missing-derivations: inserting 6 derivations
debug: insert-missing-derivations: updating hash table
debug: insert-missing-derivations: inserting outputs
debug: insert-missing-derivations: inserting sources
debug: insert-missing-derivations: ensure-input-derivations-exist
debug: ensure-input-derivations-exist: processing 144 derivations
debug: derivation-file-names->vhash: 144 file-names
debug: derivation-file-names->vhash: lookup 144 file-names, 144 not cached
debug: derivation-file-names->vhash: adding 138 entries to the cache
debug: ensure-input-derivations-exist: checking for missing input derivations
debug: insert-missing-derivations: inserting 6 derivations
debug: insert-missing-derivations: updating hash table
debug: insert-missing-derivations: inserting outputs
debug: insert-missing-derivations: inserting sources
debug: insert-missing-derivations: ensure-input-derivations-exist
debug: ensure-input-derivations-exist: processing 24 derivations
debug: derivation-file-names->vhash: 24 file-names
debug: derivation-file-names->vhash: lookup 24 file-names, 12 not cached
debug: derivation-file-names->vhash: adding 6 entries to the cache
debug: ensure-input-derivations-exist: checking for missing input derivations
debug: insert-missing-derivations: inserting 6 derivations
debug: insert-missing-derivations: updating hash table
debug: insert-missing-derivations: inserting outputs
debug: insert-missing-derivations: inserting sources
debug: insert-missing-derivations: ensure-input-derivations-exist
debug: ensure-input-derivations-exist: processing 66 derivations
debug: derivation-file-names->vhash: 66 file-names
debug: derivation-file-names->vhash: lookup 66 file-names, 36 not cached
debug: derivation-file-names->vhash: adding 30 entries to the cache
debug: ensure-input-derivations-exist: checking for missing input derivations
debug: insert-missing-derivations: inserting 6 derivations
debug: insert-missing-derivations: updating hash table
debug: insert-missing-derivations: inserting outputs
debug: insert-missing-derivations: inserting sources
debug: insert-missing-derivations: ensure-input-derivations-exist
debug: ensure-input-derivations-exist: processing 18 derivations
debug: derivation-file-names->vhash: 18 file-names
debug: derivation-file-names->vhash: lookup 18 file-names, 12 not cached
debug: derivation-file-names->vhash: adding 0 entries to the cache
debug: ensure-input-derivations-exist: checking for missing input derivations
debug: insert-missing-derivations: inserting 12 derivations
debug: insert-missing-derivations: updating hash table
debug: insert-missing-derivations: inserting outputs
debug: insert-missing-derivations: inserting sources
debug: insert-missing-derivations: ensure-input-derivations-exist
debug: ensure-input-derivations-exist: processing 84 derivations
debug: derivation-file-names->vhash: 84 file-names
debug: derivation-file-names->vhash: lookup 84 file-names, 48 not cached
debug: derivation-file-names->vhash: adding 36 entries to the cache
debug: ensure-input-derivations-exist: checking for missing input derivations
debug: insert-missing-derivations: inserting 12 derivations
debug: insert-missing-derivations: updating hash table
debug: insert-missing-derivations: inserting outputs
debug: insert-missing-derivations: inserting sources
debug: insert-missing-derivations: ensure-input-derivations-exist
debug: ensure-input-derivations-exist: processing 84 derivations
debug: derivation-file-names->vhash: 84 file-names
debug: derivation-file-names->vhash: lookup 84 file-names, 72 not cached
debug: derivation-file-names->vhash: adding 72 entries to the cache
debug: ensure-input-derivations-exist: checking for missing input derivations
debug: insert-missing-derivations: inserting inputs
debug: insert-missing-derivations: inserting inputs
debug: insert-missing-derivations: inserting inputs
debug: insert-missing-derivations: inserting inputs
debug: insert-missing-derivations: inserting inputs
debug: insert-missing-derivations: inserting inputs
debug: derivation-file-names->derivation-ids: processing 6 derivations
debug: derivation-file-names->vhash: 6 file-names
debug: derivation-file-names->vhash: lookup 6 file-names, 6 not cached
debug: derivation-file-names->vhash: adding 0 entries to the cache
debug: insert-missing-derivations: inserting 6 derivations
debug: insert-missing-derivations: updating hash table
debug: insert-missing-derivations: inserting outputs
debug: insert-missing-derivations: inserting sources
debug: insert-missing-derivations: ensure-input-derivations-exist
debug: ensure-input-derivations-exist: processing 144 derivations
debug: derivation-file-names->vhash: 144 file-names
debug: derivation-file-names->vhash: lookup 144 file-names, 144 not cached
debug: derivation-file-names->vhash: adding 138 entries to the cache
debug: ensure-input-derivations-exist: checking for missing input derivations
debug: insert-missing-derivations: inserting 6 derivations
debug: insert-missing-derivations: updating hash table
debug: insert-missing-derivations: inserting outputs
debug: insert-missing-derivations: inserting sources
debug: insert-missing-derivations: ensure-input-derivations-exist
debug: ensure-input-derivations-exist: processing 24 derivations
debug: derivation-file-names->vhash: 24 file-names
debug: derivation-file-names->vhash: lookup 24 file-names, 12 not cached
debug: derivation-file-names->vhash: adding 6 entries to the cache
debug: ensure-input-derivations-exist: checking for missing input derivations
debug: insert-missing-derivations: inserting 6 derivations
debug: insert-missing-derivations: updating hash table
debug: insert-missing-derivations: inserting outputs
debug: insert-missing-derivations: inserting sources
debug: insert-missing-derivations: ensure-input-derivations-exist
debug: ensure-input-derivations-exist: processing 66 derivations
debug: derivation-file-names->vhash: 66 file-names
debug: derivation-file-names->vhash: lookup 66 file-names, 36 not cached
debug: derivation-file-names->vhash: adding 30 entries to the cache
debug: ensure-input-derivations-exist: checking for missing input derivations
debug: insert-missing-derivations: inserting 6 derivations
debug: insert-missing-derivations: updating hash table
debug: insert-missing-derivations: inserting outputs
debug: insert-missing-derivations: inserting sources
debug: insert-missing-derivations: ensure-input-derivations-exist
debug: ensure-input-derivations-exist: processing 18 derivations
debug: derivation-file-names->vhash: 18 file-names
debug: derivation-file-names->vhash: lookup 18 file-names, 12 not cached
debug: derivation-file-names->vhash: adding 0 entries to the cache
debug: ensure-input-derivations-exist: checking for missing input derivations
debug: insert-missing-derivations: inserting 12 derivations
debug: insert-missing-derivations: updating hash table
debug: insert-missing-derivations: inserting outputs
debug: insert-missing-derivations: inserting sources
debug: insert-missing-derivations: ensure-input-derivations-exist
debug: ensure-input-derivations-exist: processing 84 derivations
debug: derivation-file-names->vhash: 84 file-names
debug: derivation-file-names->vhash: lookup 84 file-names, 48 not cached
debug: derivation-file-names->vhash: adding 36 entries to the cache
debug: ensure-input-derivations-exist: checking for missing input derivations
debug: insert-missing-derivations: inserting 12 derivations
debug: insert-missing-derivations: updating hash table
debug: insert-missing-derivations: inserting outputs
debug: insert-missing-derivations: inserting sources
debug: insert-missing-derivations: ensure-input-derivations-exist
debug: ensure-input-derivations-exist: processing 84 derivations
debug: derivation-file-names->vhash: 84 file-names
debug: derivation-file-names->vhash: lookup 84 file-names, 72 not cached
debug: derivation-file-names->vhash: adding 66 entries to the cache
debug: ensure-input-derivations-exist: checking for missing input derivations
debug: insert-missing-derivations: inserting 6 derivations
debug: insert-missing-derivations: updating hash table
debug: insert-missing-derivations: inserting outputs
debug: insert-missing-derivations: inserting sources
debug: insert-missing-derivations: ensure-input-derivations-exist
debug: ensure-input-derivations-exist: processing 576 derivations
debug: derivation-file-names->vhash: 576 file-names
debug: derivation-file-names->vhash: lookup 576 file-names, 432 not cached
debug: derivation-file-names->vhash: adding 390 entries to the cache
debug: ensure-input-derivations-exist: checking for missing input derivations
debug: insert-missing-derivations: inserting 42 derivations
debug: insert-missing-derivations: updating hash table
debug: insert-missing-derivations: inserting outputs
debug: insert-missing-derivations: inserting sources
debug: insert-missing-derivations: ensure-input-derivations-exist
debug: ensure-input-derivations-exist: processing 600 derivations
debug: derivation-file-names->vhash: 600 file-names
debug: derivation-file-names->vhash: lookup 600 file-names, 60 not cached
debug: derivation-file-names->vhash: adding 60 entries to the cache
debug: ensure-input-derivations-exist: checking for missing input derivations
debug: insert-missing-derivations: inserting inputs
debug: insert-missing-derivations: inserting inputs
debug: insert-missing-derivations: inserting inputs
debug: insert-missing-derivations: inserting inputs
debug: insert-missing-derivations: inserting inputs
debug: insert-missing-derivations: inserting inputs
debug: insert-missing-derivations: inserting inputs
debug: insert-missing-derivations: inserting inputs
debug: derivation-file-names->derivation-ids: processing 6 derivations
debug: derivation-file-names->vhash: 6 file-names
debug: derivation-file-names->vhash: lookup 6 file-names, 6 not cached
debug: derivation-file-names->vhash: adding 0 entries to the cache
debug: insert-missing-derivations: inserting 6 derivations
debug: insert-missing-derivations: updating hash table
debug: insert-missing-derivations: inserting outputs
debug: insert-missing-derivations: inserting sources
debug: insert-missing-derivations: ensure-input-derivations-exist
debug: ensure-input-derivations-exist: processing 144 derivations
debug: derivation-file-names->vhash: 144 file-names
debug: derivation-file-names->vhash: lookup 144 file-names, 144 not cached
debug: derivation-file-names->vhash: adding 138 entries to the cache
debug: ensure-input-derivations-exist: checking for missing input derivations
debug: insert-missing-derivations: inserting 6 derivations
debug: insert-missing-derivations: updating hash table
debug: insert-missing-derivations: inserting outputs
debug: insert-missing-derivations: inserting sources
debug: insert-missing-derivations: ensure-input-derivations-exist
debug: ensure-input-derivations-exist: processing 24 derivations
debug: derivation-file-names->vhash: 24 file-names
debug: derivation-file-names->vhash: lookup 24 file-names, 12 not cached
debug: derivation-file-names->vhash: adding 6 entries to the cache
debug: ensure-input-derivations-exist: checking for missing input derivations
debug: insert-missing-derivations: inserting 6 derivations
debug: insert-missing-derivations: updating hash table
debug: insert-missing-derivations: inserting outputs
debug: insert-missing-derivations: inserting sources
debug: insert-missing-derivations: ensure-input-derivations-exist
debug: ensure-input-derivations-exist: processing 66 derivations
debug: derivation-file-names->vhash: 66 file-names
debug: derivation-file-names->vhash: lookup 66 file-names, 36 not cached
debug: derivation-file-names->vhash: adding 30 entries to the cache
debug: ensure-input-derivations-exist: checking for missing input derivations
debug: insert-missing-derivations: inserting 6 derivations
debug: insert-missing-derivations: updating hash table
debug: insert-missing-derivations: inserting outputs
debug: insert-missing-derivations: inserting sources
debug: insert-missing-derivations: ensure-input-derivations-exist
debug: ensure-input-derivations-exist: processing 18 derivations
debug: derivation-file-names->vhash: 18 file-names
debug: derivation-file-names->vhash: lookup 18 file-names, 12 not cached
debug: derivation-file-names->vhash: adding 0 entries to the cache
debug: ensure-input-derivations-exist: checking for missing input derivations
debug: insert-missing-derivations: inserting 12 derivations
debug: insert-missing-derivations: updating hash table
debug: insert-missing-derivations: inserting outputs
debug: insert-missing-derivations: inserting sources
debug: insert-missing-derivations: ensure-input-derivations-exist
debug: ensure-input-derivations-exist: processing 84 derivations
debug: derivation-file-names->vhash: 84 file-names
debug: derivation-file-names->vhash: lookup 84 file-names, 48 not cached
debug: derivation-file-names->vhash: adding 36 entries to the cache
debug: ensure-input-derivations-exist: checking for missing input derivations
debug: insert-missing-derivations: inserting 12 derivations
debug: insert-missing-derivations: updating hash table
debug: insert-missing-derivations: inserting outputs
debug: insert-missing-derivations: inserting sources
debug: insert-missing-derivations: ensure-input-derivations-exist
debug: ensure-input-derivations-exist: processing 84 derivations
debug: derivation-file-names->vhash: 84 file-names
debug: derivation-file-names->vhash: lookup 84 file-names, 72 not cached
debug: derivation-file-names->vhash: adding 72 entries to the cache
debug: ensure-input-derivations-exist: checking for missing input derivations
debug: insert-missing-derivations: inserting inputs
debug: insert-missing-derivations: inserting inputs
debug: insert-missing-derivations: inserting inputs
debug: insert-missing-derivations: inserting inputs
debug: insert-missing-derivations: inserting inputs
debug: insert-missing-derivations: inserting inputs
debug: derivation-file-names->derivation-ids: processing 6 derivations
debug: derivation-file-names->vhash: 6 file-names
debug: derivation-file-names->vhash: lookup 6 file-names, 6 not cached
debug: derivation-file-names->vhash: adding 0 entries to the cache
debug: insert-missing-derivations: inserting 6 derivations
debug: insert-missing-derivations: updating hash table
debug: insert-missing-derivations: inserting outputs
debug: insert-missing-derivations: inserting sources
debug: insert-missing-derivations: ensure-input-derivations-exist
debug: ensure-input-derivations-exist: processing 144 derivations
debug: derivation-file-names->vhash: 144 file-names
debug: derivation-file-names->vhash: lookup 144 file-names, 144 not cached
debug: derivation-file-names->vhash: adding 138 entries to the cache
debug: ensure-input-derivations-exist: checking for missing input derivations
debug: insert-missing-derivations: inserting 6 derivations
debug: insert-missing-derivations: updating hash table
debug: insert-missing-derivations: inserting outputs
debug: insert-missing-derivations: inserting sources
debug: insert-missing-derivations: ensure-input-derivations-exist
debug: ensure-input-derivations-exist: processing 30 derivations
debug: derivation-file-names->vhash: 30 file-names
debug: derivation-file-names->vhash: lookup 30 file-names, 18 not cached
debug: derivation-file-names->vhash: adding 12 entries to the cache
debug: ensure-input-derivations-exist: checking for missing input derivations
debug: insert-missing-derivations: inserting 6 derivations
debug: insert-missing-derivations: updating hash table
debug: insert-missing-derivations: inserting outputs
debug: insert-missing-derivations: inserting sources
debug: insert-missing-derivations: ensure-input-derivations-exist
debug: ensure-input-derivations-exist: processing 108 derivations
debug: derivation-file-names->vhash: 108 file-names
debug: derivation-file-names->vhash: lookup 108 file-names, 84 not cached
debug: derivation-file-names->vhash: adding 72 entries to the cache
debug: ensure-input-derivations-exist: checking for missing input derivations
debug: insert-missing-derivations: inserting 12 derivations
debug: insert-missing-derivations: updating hash table
debug: insert-missing-derivations: inserting outputs
debug: insert-missing-derivations: inserting sources
debug: insert-missing-derivations: ensure-input-derivations-exist
debug: ensure-input-derivations-exist: processing 84 derivations
debug: derivation-file-names->vhash: 84 file-names
debug: derivation-file-names->vhash: lookup 84 file-names, 72 not cached
debug: derivation-file-names->vhash: adding 72 entries to the cache
debug: ensure-input-derivations-exist: checking for missing input derivations
debug: insert-missing-derivations: inserting inputs
debug: insert-missing-derivations: inserting inputs
debug: insert-missing-derivations: inserting inputs
debug: insert-missing-derivations: inserting inputs
debug: derivation-file-names->derivation-ids: processing 6 derivations
debug: derivation-file-names->vhash: 6 file-names
debug: derivation-file-names->vhash: lookup 6 file-names, 6 not cached
debug: derivation-file-names->vhash: adding 0 entries to the cache
debug: insert-missing-derivations: inserting 6 derivations
debug: insert-missing-derivations: updating hash table
debug: insert-missing-derivations: inserting outputs
debug: insert-missing-derivations: inserting sources
debug: insert-missing-derivations: ensure-input-derivations-exist
debug: ensure-input-derivations-exist: processing 144 derivations
debug: derivation-file-names->vhash: 144 file-names
debug: derivation-file-names->vhash: lookup 144 file-names, 144 not cached
debug: derivation-file-names->vhash: adding 138 entries to the cache
debug: ensure-input-derivations-exist: checking for missing input derivations
debug: insert-missing-derivations: inserting 6 derivations
debug: insert-missing-derivations: updating hash table
debug: insert-missing-derivations: inserting outputs
debug: insert-missing-derivations: inserting sources
debug: insert-missing-derivations: ensure-input-derivations-exist
debug: ensure-input-derivations-exist: processing 24 derivations
debug: derivation-file-names->vhash: 24 file-names
debug: derivation-file-names->vhash: lookup 24 file-names, 12 not cached
debug: derivation-file-names->vhash: adding 6 entries to the cache
debug: ensure-input-derivations-exist: checking for missing input derivations
debug: insert-missing-derivations: inserting 6 derivations
debug: insert-missing-derivations: updating hash table
debug: insert-missing-derivations: inserting outputs
debug: insert-missing-derivations: inserting sources
debug: insert-missing-derivations: ensure-input-derivations-exist
debug: ensure-input-derivations-exist: processing 66 derivations
debug: derivation-file-names->vhash: 66 file-names
debug: derivation-file-names->vhash: lookup 66 file-names, 36 not cached
debug: derivation-file-names->vhash: adding 30 entries to the cache
debug: ensure-input-derivations-exist: checking for missing input derivations
debug: insert-missing-derivations: inserting 6 derivations
debug: insert-missing-derivations: updating hash table
debug: insert-missing-derivations: inserting outputs
debug: insert-missing-derivations: inserting sources
debug: insert-missing-derivations: ensure-input-derivations-exist
debug: ensure-input-derivations-exist: processing 18 derivations
debug: derivation-file-names->vhash: 18 file-names
debug: derivation-file-names->vhash: lookup 18 file-names, 12 not cached
debug: derivation-file-names->vhash: adding 0 entries to the cache
debug: ensure-input-derivations-exist: checking for missing input derivations
debug: insert-missing-derivations: inserting 12 derivations
debug: insert-missing-derivations: updating hash table
debug: insert-missing-derivations: inserting outputs
debug: insert-missing-derivations: inserting sources
debug: insert-missing-derivations: ensure-input-derivations-exist
debug: ensure-input-derivations-exist: processing 84 derivations
debug: derivation-file-names->vhash: 84 file-names
debug: derivation-file-names->vhash: lookup 84 file-names, 48 not cached
debug: derivation-file-names->vhash: adding 36 entries to the cache
debug: ensure-input-derivations-exist: checking for missing input derivations
debug: insert-missing-derivations: inserting 12 derivations
debug: insert-missing-derivations: updating hash table
debug: insert-missing-derivations: inserting outputs
debug: insert-missing-derivations: inserting sources
debug: insert-missing-derivations: ensure-input-derivations-exist
debug: ensure-input-derivations-exist: processing 84 derivations
debug: derivation-file-names->vhash: 84 file-names
debug: derivation-file-names->vhash: lookup 84 file-names, 72 not cached
debug: derivation-file-names->vhash: adding 72 entries to the cache
debug: ensure-input-derivations-exist: checking for missing input derivations
debug: insert-missing-derivations: inserting inputs
debug: insert-missing-derivations: inserting inputs
debug: insert-missing-derivations: inserting inputs
debug: insert-missing-derivations: inserting inputs
debug: insert-missing-derivations: inserting inputs
debug: insert-missing-derivations: inserting inputs
debug: derivation-file-names->derivation-ids: processing 6 derivations
debug: derivation-file-names->vhash: 6 file-names
debug: derivation-file-names->vhash: lookup 6 file-names, 6 not cached
debug: derivation-file-names->vhash: adding 0 entries to the cache
debug: insert-missing-derivations: inserting 6 derivations
debug: insert-missing-derivations: updating hash table
debug: insert-missing-derivations: inserting outputs
debug: insert-missing-derivations: inserting sources
debug: insert-missing-derivations: ensure-input-derivations-exist
debug: ensure-input-derivations-exist: processing 144 derivations
debug: derivation-file-names->vhash: 144 file-names
debug: derivation-file-names->vhash: lookup 144 file-names, 144 not cached
debug: derivation-file-names->vhash: adding 138 entries to the cache
debug: ensure-input-derivations-exist: checking for missing input derivations
debug: insert-missing-derivations: inserting 6 derivations
debug: insert-missing-derivations: updating hash table
debug: insert-missing-derivations: inserting outputs
debug: insert-missing-derivations: inserting sources
debug: insert-missing-derivations: ensure-input-derivations-exist
debug: ensure-input-derivations-exist: processing 30 derivations
debug: derivation-file-names->vhash: 30 file-names
debug: derivation-file-names->vhash: lookup 30 file-names, 18 not cached
debug: derivation-file-names->vhash: adding 12 entries to the cache
debug: ensure-input-derivations-exist: checking for missing input derivations
debug: insert-missing-derivations: inserting 6 derivations
debug: insert-missing-derivations: updating hash table
debug: insert-missing-derivations: inserting outputs
debug: insert-missing-derivations: inserting sources
debug: insert-missing-derivations: ensure-input-derivations-exist
debug: ensure-input-derivations-exist: processing 108 derivations
debug: derivation-file-names->vhash: 108 file-names
debug: derivation-file-names->vhash: lookup 108 file-names, 84 not cached
debug: derivation-file-names->vhash: adding 72 entries to the cache
debug: ensure-input-derivations-exist: checking for missing input derivations
debug: insert-missing-derivations: inserting 12 derivations
debug: insert-missing-derivations: updating hash table
debug: insert-missing-derivations: inserting outputs
debug: insert-missing-derivations: inserting sources
debug: insert-missing-derivations: ensure-input-derivations-exist
debug: ensure-input-derivations-exist: processing 84 derivations
debug: derivation-file-names->vhash: 84 file-names
debug: derivation-file-names->vhash: lookup 84 file-names, 72 not cached
debug: derivation-file-names->vhash: adding 72 entries to the cache
debug: ensure-input-derivations-exist: checking for missing input derivations
debug: insert-missing-derivations: inserting inputs
debug: insert-missing-derivations: inserting inputs
debug: insert-missing-derivations: inserting inputs
debug: insert-missing-derivations: inserting inputs
debug: derivation-file-names->derivation-ids: processing 6 derivations
debug: derivation-file-names->vhash: 6 file-names
debug: derivation-file-names->vhash: lookup 6 file-names, 6 not cached
debug: derivation-file-names->vhash: adding 0 entries to the cache
debug: insert-missing-derivations: inserting 6 derivations
debug: insert-missing-derivations: updating hash table
debug: insert-missing-derivations: inserting outputs
debug: insert-missing-derivations: inserting sources
debug: insert-missing-derivations: ensure-input-derivations-exist
debug: ensure-input-derivations-exist: processing 144 derivations
debug: derivation-file-names->vhash: 144 file-names
debug: derivation-file-names->vhash: lookup 144 file-names, 144 not cached
debug: derivation-file-names->vhash: adding 138 entries to the cache
debug: ensure-input-derivations-exist: checking for missing input derivations
debug: insert-missing-derivations: inserting 6 derivations
debug: insert-missing-derivations: updating hash table
debug: insert-missing-derivations: inserting outputs
debug: insert-missing-derivations: inserting sources
debug: insert-missing-derivations: ensure-input-derivations-exist
debug: ensure-input-derivations-exist: processing 24 derivations
debug: derivation-file-names->vhash: 24 file-names
debug: derivation-file-names->vhash: lookup 24 file-names, 12 not cached
debug: derivation-file-names->vhash: adding 6 entries to the cache
debug: ensure-input-derivations-exist: checking for missing input derivations
debug: insert-missing-derivations: inserting 6 derivations
debug: insert-missing-derivations: updating hash table
debug: insert-missing-derivations: inserting outputs
debug: insert-missing-derivations: inserting sources
debug: insert-missing-derivations: ensure-input-derivations-exist
debug: ensure-input-derivations-exist: processing 66 derivations
debug: derivation-file-names->vhash: 66 file-names
debug: derivation-file-names->vhash: lookup 66 file-names, 36 not cached
debug: derivation-file-names->vhash: adding 30 entries to the cache
debug: ensure-input-derivations-exist: checking for missing input derivations
debug: insert-missing-derivations: inserting 6 derivations
debug: insert-missing-derivations: updating hash table
debug: insert-missing-derivations: inserting outputs
debug: insert-missing-derivations: inserting sources
debug: insert-missing-derivations: ensure-input-derivations-exist
debug: ensure-input-derivations-exist: processing 18 derivations
debug: derivation-file-names->vhash: 18 file-names
debug: derivation-file-names->vhash: lookup 18 file-names, 12 not cached
debug: derivation-file-names->vhash: adding 0 entries to the cache
debug: ensure-input-derivations-exist: checking for missing input derivations
debug: insert-missing-derivations: inserting 12 derivations
debug: insert-missing-derivations: updating hash table
debug: insert-missing-derivations: inserting outputs
debug: insert-missing-derivations: inserting sources
debug: insert-missing-derivations: ensure-input-derivations-exist
debug: ensure-input-derivations-exist: processing 84 derivations
debug: derivation-file-names->vhash: 84 file-names
debug: derivation-file-names->vhash: lookup 84 file-names, 48 not cached
debug: derivation-file-names->vhash: adding 36 entries to the cache
debug: ensure-input-derivations-exist: checking for missing input derivations
debug: insert-missing-derivations: inserting 12 derivations
debug: insert-missing-derivations: updating hash table
debug: insert-missing-derivations: inserting outputs
debug: insert-missing-derivations: inserting sources
debug: insert-missing-derivations: ensure-input-derivations-exist
debug: ensure-input-derivations-exist: processing 84 derivations
debug: derivation-file-names->vhash: 84 file-names
debug: derivation-file-names->vhash: lookup 84 file-names, 72 not cached
debug: derivation-file-names->vhash: adding 72 entries to the cache
debug: ensure-input-derivations-exist: checking for missing input derivations
debug: insert-missing-derivations: inserting inputs
debug: insert-missing-derivations: inserting inputs
debug: insert-missing-derivations: inserting inputs
debug: insert-missing-derivations: inserting inputs
debug: insert-missing-derivations: inserting inputs
debug: insert-missing-derivations: inserting inputs
debug: derivation-file-names->derivation-ids: processing 6 derivations
debug: derivation-file-names->vhash: 6 file-names
debug: derivation-file-names->vhash: lookup 6 file-names, 6 not cached
debug: derivation-file-names->vhash: adding 6 entries to the cache
debug: derivation-file-names->derivation-ids: processing 6 derivations
debug: derivation-file-names->vhash: 6 file-names
debug: derivation-file-names->vhash: lookup 6 file-names, 6 not cached
debug: derivation-file-names->vhash: adding 6 entries to the cache
debug: derivation-file-names->derivation-ids: processing 6 derivations
debug: derivation-file-names->vhash: 6 file-names
debug: derivation-file-names->vhash: lookup 6 file-names, 6 not cached
debug: derivation-file-names->vhash: adding 6 entries to the cache
debug: derivation-file-names->derivation-ids: processing 6 derivations
debug: derivation-file-names->vhash: 6 file-names
debug: derivation-file-names->vhash: lookup 6 file-names, 6 not cached
debug: derivation-file-names->vhash: adding 6 entries to the cache
debug: derivation-file-names->derivation-ids: processing 6 derivations
debug: derivation-file-names->vhash: 6 file-names
debug: derivation-file-names->vhash: lookup 6 file-names, 6 not cached
debug: derivation-file-names->vhash: adding 6 entries to the cache
debug: derivation-file-names->derivation-ids: processing 6 derivations
debug: derivation-file-names->vhash: 6 file-names
debug: derivation-file-names->vhash: lookup 6 file-names, 6 not cached
debug: derivation-file-names->vhash: adding 6 entries to the cache
debug: derivation-file-names->derivation-ids: processing 6 derivations
debug: derivation-file-names->vhash: 6 file-names
debug: derivation-file-names->vhash: lookup 6 file-names, 6 not cached
debug: derivation-file-names->vhash: adding 6 entries to the cache
debug: derivation-file-names->derivation-ids: processing 6 derivations
debug: derivation-file-names->vhash: 6 file-names
debug: derivation-file-names->vhash: lookup 6 file-names, 6 not cached
debug: derivation-file-names->vhash: adding 6 entries to the cache
debug: derivation-file-names->derivation-ids: processing 6 derivations
debug: derivation-file-names->vhash: 6 file-names
debug: derivation-file-names->vhash: lookup 6 file-names, 6 not cached
debug: derivation-file-names->vhash: adding 6 entries to the cache
debug: derivation-file-names->derivation-ids: processing 6 derivations
debug: derivation-file-names->vhash: 6 file-names
debug: derivation-file-names->vhash: lookup 6 file-names, 6 not cached
debug: derivation-file-names->vhash: adding 6 entries to the cache
debug: derivation-file-names->derivation-ids: processing 6 derivations
debug: derivation-file-names->vhash: 6 file-names
debug: derivation-file-names->vhash: lookup 6 file-names, 6 not cached
debug: derivation-file-names->vhash: adding 6 entries to the cache
debug: derivation-file-names->derivation-ids: processing 6 derivations
debug: derivation-file-names->vhash: 6 file-names
debug: derivation-file-names->vhash: lookup 6 file-names, 6 not cached
debug: derivation-file-names->vhash: adding 6 entries to the cache
debug: derivation-file-names->derivation-ids: processing 6 derivations
debug: derivation-file-names->vhash: 6 file-names
debug: derivation-file-names->vhash: lookup 6 file-names, 6 not cached
debug: derivation-file-names->vhash: adding 6 entries to the cache
debug: derivation-file-names->derivation-ids: processing 6 derivations
debug: derivation-file-names->vhash: 6 file-names
debug: derivation-file-names->vhash: lookup 6 file-names, 6 not cached
debug: derivation-file-names->vhash: adding 6 entries to the cache
debug: derivation-file-names->derivation-ids: processing 6 derivations
debug: derivation-file-names->vhash: 6 file-names
debug: derivation-file-names->vhash: lookup 6 file-names, 6 not cached
debug: derivation-file-names->vhash: adding 6 entries to the cache
debug: derivation-file-names->derivation-ids: processing 6 derivations
debug: derivation-file-names->vhash: 6 file-names
debug: derivation-file-names->vhash: lookup 6 file-names, 6 not cached
debug: derivation-file-names->vhash: adding 6 entries to the cache
debug: derivation-file-names->derivation-ids: processing 6 derivations
debug: derivation-file-names->vhash: 6 file-names
debug: derivation-file-names->vhash: lookup 6 file-names, 6 not cached
debug: derivation-file-names->vhash: adding 6 entries to the cache
debug: derivation-file-names->derivation-ids: processing 6 derivations
debug: derivation-file-names->vhash: 6 file-names
debug: derivation-file-names->vhash: lookup 6 file-names, 6 not cached
debug: derivation-file-names->vhash: adding 6 entries to the cache
debug: derivation-file-names->derivation-ids: processing 6 derivations
debug: derivation-file-names->vhash: 6 file-names
debug: derivation-file-names->vhash: lookup 6 file-names, 6 not cached
debug: derivation-file-names->vhash: adding 6 entries to the cache
debug: derivation-file-names->derivation-ids: processing 6 derivations
debug: derivation-file-names->vhash: 6 file-names
debug: derivation-file-names->vhash: lookup 6 file-names, 6 not cached
debug: derivation-file-names->vhash: adding 6 entries to the cache
debug: derivation-file-names->derivation-ids: processing 6 derivations
debug: derivation-file-names->vhash: 6 file-names
debug: derivation-file-names->vhash: lookup 6 file-names, 6 not cached
debug: derivation-file-names->vhash: adding 6 entries to the cache
debug: derivation-file-names->derivation-ids: processing 6 derivations
debug: derivation-file-names->vhash: 6 file-names
debug: derivation-file-names->vhash: lookup 6 file-names, 6 not cached
debug: derivation-file-names->vhash: adding 6 entries to the cache
debug: derivation-file-names->derivation-ids: processing 6 derivations
debug: derivation-file-names->vhash: 6 file-names
debug: derivation-file-names->vhash: lookup 6 file-names, 6 not cached
debug: derivation-file-names->vhash: adding 6 entries to the cache
debug: derivation-file-names->derivation-ids: processing 6 derivations
debug: derivation-file-names->vhash: 6 file-names
debug: derivation-file-names->vhash: lookup 6 file-names, 6 not cached
debug: derivation-file-names->vhash: adding 6 entries to the cache
debug: derivation-file-names->derivation-ids: processing 6 derivations
debug: derivation-file-names->vhash: 6 file-names
debug: derivation-file-names->vhash: lookup 6 file-names, 6 not cached
debug: derivation-file-names->vhash: adding 6 entries to the cache
debug: derivation-file-names->derivation-ids: processing 6 derivations
debug: derivation-file-names->vhash: 6 file-names
debug: derivation-file-names->vhash: lookup 6 file-names, 6 not cached
debug: derivation-file-names->vhash: adding 6 entries to the cache
debug: derivation-file-names->derivation-ids: processing 6 derivations
debug: derivation-file-names->vhash: 6 file-names
debug: derivation-file-names->vhash: lookup 6 file-names, 6 not cached
debug: derivation-file-names->vhash: adding 6 entries to the cache
debug: derivation-file-names->derivation-ids: processing 6 derivations
debug: derivation-file-names->vhash: 6 file-names
debug: derivation-file-names->vhash: lookup 6 file-names, 6 not cached
debug: derivation-file-names->vhash: adding 6 entries to the cache
debug: derivation-file-names->derivation-ids: processing 6 derivations
debug: derivation-file-names->vhash: 6 file-names
debug: derivation-file-names->vhash: lookup 6 file-names, 6 not cached
debug: derivation-file-names->vhash: adding 6 entries to the cache
debug: derivation-file-names->derivation-ids: processing 6 derivations
debug: derivation-file-names->vhash: 6 file-names
debug: derivation-file-names->vhash: lookup 6 file-names, 6 not cached
debug: derivation-file-names->vhash: adding 6 entries to the cache
debug: derivation-file-names->derivation-ids: processing 6 derivations
debug: derivation-file-names->vhash: 6 file-names
debug: derivation-file-names->vhash: lookup 6 file-names, 6 not cached
debug: derivation-file-names->vhash: adding 6 entries to the cache
debug: derivation-file-names->derivation-ids: processing 6 derivations
debug: derivation-file-names->vhash: 6 file-names
debug: derivation-file-names->vhash: lookup 6 file-names, 6 not cached
debug: derivation-file-names->vhash: adding 6 entries to the cache
debug: derivation-file-names->derivation-ids: processing 6 derivations
debug: derivation-file-names->vhash: 6 file-names
debug: derivation-file-names->vhash: lookup 6 file-names, 6 not cached
debug: derivation-file-names->vhash: adding 6 entries to the cache
debug: derivation-file-names->derivation-ids: processing 6 derivations
debug: derivation-file-names->vhash: 6 file-names
debug: derivation-file-names->vhash: lookup 6 file-names, 6 not cached
debug: derivation-file-names->vhash: adding 6 entries to the cache
debug: derivation-file-names->derivation-ids: processing 6 derivations
debug: derivation-file-names->vhash: 6 file-names
debug: derivation-file-names->vhash: lookup 6 file-names, 6 not cached
debug: derivation-file-names->vhash: adding 6 entries to the cache
debug: derivation-file-names->derivation-ids: processing 6 derivations
debug: derivation-file-names->vhash: 6 file-names
debug: derivation-file-names->vhash: lookup 6 file-names, 6 not cached
debug: derivation-file-names->vhash: adding 6 entries to the cache
debug: derivation-file-names->derivation-ids: processing 6 derivations
debug: derivation-file-names->vhash: 6 file-names
debug: derivation-file-names->vhash: lookup 6 file-names, 6 not cached
debug: derivation-file-names->vhash: adding 6 entries to the cache
debug: derivation-file-names->derivation-ids: processing 6 derivations
debug: derivation-file-names->vhash: 6 file-names
debug: derivation-file-names->vhash: lookup 6 file-names, 6 not cached
debug: derivation-file-names->vhash: adding 6 entries to the cache
debug: derivation-file-names->derivation-ids: processing 6 derivations
debug: derivation-file-names->vhash: 6 file-names
debug: derivation-file-names->vhash: lookup 6 file-names, 6 not cached
debug: derivation-file-names->vhash: adding 6 entries to the cache
debug: derivation-file-names->derivation-ids: processing 6 derivations
debug: derivation-file-names->vhash: 6 file-names
debug: derivation-file-names->vhash: lookup 6 file-names, 6 not cached
debug: derivation-file-names->vhash: adding 6 entries to the cache
debug: derivation-file-names->derivation-ids: processing 6 derivations
debug: derivation-file-names->vhash: 6 file-names
debug: derivation-file-names->vhash: lookup 6 file-names, 6 not cached
debug: derivation-file-names->vhash: adding 6 entries to the cache
debug: derivation-file-names->derivation-ids: processing 6 derivations
debug: derivation-file-names->vhash: 6 file-names
debug: derivation-file-names->vhash: lookup 6 file-names, 6 not cached
debug: derivation-file-names->vhash: adding 6 entries to the cache
debug: Starting inferior-data->package-derivation-ids
debug: derivation-file-names->derivation-ids: processing 107117 derivations
debug: derivation-file-names->vhash: 107117 file-names
debug: derivation-file-names->vhash: lookup 107117 file-names, 107117 not cached
debug: derivation-file-names->vhash: adding 106260 entries to the cache
debug: Finished inferior-data->package-derivation-ids, took 56 seconds
Successfully loaded 107117 package/derivation pairs
debug: derivation-file-names->derivation-ids: processing 3 derivations
debug: derivation-file-names->vhash: 3 file-names
debug: derivation-file-names->vhash: lookup 3 file-names, 3 not cached
debug: derivation-file-names->vhash: adding 0 entries to the cache
debug: insert-missing-derivations: inserting 3 derivations
debug: insert-missing-derivations: updating hash table
debug: insert-missing-derivations: inserting outputs
debug: insert-missing-derivations: inserting sources
debug: insert-missing-derivations: ensure-input-derivations-exist
debug: ensure-input-derivations-exist: processing 18 derivations
debug: derivation-file-names->vhash: 18 file-names
debug: derivation-file-names->vhash: lookup 18 file-names, 18 not cached
debug: derivation-file-names->vhash: adding 9 entries to the cache
debug: ensure-input-derivations-exist: checking for missing input derivations
debug: insert-missing-derivations: inserting 9 derivations
debug: insert-missing-derivations: updating hash table
debug: insert-missing-derivations: inserting outputs
debug: insert-missing-derivations: inserting sources
debug: insert-missing-derivations: ensure-input-derivations-exist
debug: ensure-input-derivations-exist: processing 54 derivations
debug: derivation-file-names->vhash: 54 file-names
debug: derivation-file-names->vhash: lookup 54 file-names, 48 not cached
debug: derivation-file-names->vhash: adding 27 entries to the cache
debug: ensure-input-derivations-exist: checking for missing input derivations
debug: insert-missing-derivations: inserting 21 derivations
debug: insert-missing-derivations: updating hash table
debug: insert-missing-derivations: inserting outputs
debug: insert-missing-derivations: inserting sources
debug: insert-missing-derivations: ensure-input-derivations-exist
debug: ensure-input-derivations-exist: processing 84 derivations
debug: derivation-file-names->vhash: 84 file-names
debug: derivation-file-names->vhash: lookup 84 file-names, 72 not cached
debug: derivation-file-names->vhash: adding 51 entries to the cache
debug: ensure-input-derivations-exist: checking for missing input derivations
debug: insert-missing-derivations: inserting 21 derivations
debug: insert-missing-derivations: updating hash table
debug: insert-missing-derivations: inserting outputs
debug: insert-missing-derivations: inserting sources
debug: insert-missing-derivations: ensure-input-derivations-exist
debug: ensure-input-derivations-exist: processing 84 derivations
debug: derivation-file-names->vhash: 84 file-names
debug: derivation-file-names->vhash: lookup 84 file-names, 15 not cached
debug: derivation-file-names->vhash: adding 12 entries to the cache
debug: ensure-input-derivations-exist: checking for missing input derivations
debug: insert-missing-derivations: inserting 3 derivations
debug: insert-missing-derivations: updating hash table
debug: insert-missing-derivations: inserting outputs
debug: insert-missing-derivations: inserting sources
debug: insert-missing-derivations: ensure-input-derivations-exist
debug: ensure-input-derivations-exist: processing 12 derivations
debug: derivation-file-names->vhash: 12 file-names
debug: derivation-file-names->vhash: lookup 12 file-names, 9 not cached
debug: derivation-file-names->vhash: adding 9 entries to the cache
debug: ensure-input-derivations-exist: checking for missing input derivations
debug: insert-missing-derivations: inserting inputs
debug: insert-missing-derivations: inserting inputs
debug: insert-missing-derivations: inserting inputs
debug: insert-missing-derivations: inserting inputs
debug: insert-missing-derivations: inserting inputs
debug: Starting inserting channel news entries
debug: Finished inserting channel news entries, took 4 seconds
debug: Starting deleting package derivation entries for master
debug: Finished deleting package derivation entries for master, took 19 seconds
debug: Starting inserting package derivation entries for master
debug: Finished inserting package derivation entries for master, took 537 seconds