Job 20622

Return at most this many characters.
Start reading the log from this character.
debug: Starting computing the channel derivation
debug: using open-inferior
debug: Acquiring advisory session lock: latest-channel-instances
debug: Finished aquiring lock latest-channel-instances, took 0 seconds
Updating channel 'guix' from Git repository at 'https://git.savannah.gnu.org/git/guix.git'...
Authenticating channel 'guix', commits 9edb3f6 to 4ea5767 (3 new commits)...

[#########################                                                     ]
[###################################################                           ]
[##############################################################################]
debug: Releasing lock latest-channel-instances, spent 33 seconds
guix repl: warning: 'nix-protocol-error?' is deprecated, use 'store-protocol-error?' instead
guix repl: warning: 'nix-protocol-error-message' is deprecated, use 'store-protocol-error-message' instead
guix-data-service: computing the derivation-file-name for x86_64-linux
Computing Guix derivation for 'x86_64-linux'...  
guix-data-service: computing the derivation-file-name for i686-linux
Computing Guix derivation for 'i686-linux'...  
guix-data-service: computing the derivation-file-name for armhf-linux
Computing Guix derivation for 'armhf-linux'...  substitute: 
substitute: updating substitutes from 'https://ci.guix.gnu.org'...   0.0%
substitute: updating substitutes from 'https://ci.guix.gnu.org'... 100.0%
substitute: 
substitute: updating substitutes from 'https://ci.guix.gnu.org'...   0.0%
substitute: updating substitutes from 'https://ci.guix.gnu.org'... 100.0%
@ build-started /gnu/store/1v3a974h6rfgyqlwjilygi8jzl2hfxd8-guile-lzlib-0.0.2.drv - armhf-linux /var/log/guix/drvs/1v//3a974h6rfgyqlwjilygi8jzl2hfxd8-guile-lzlib-0.0.2.drv.bz2 32230
starting phase `set-SOURCE-DATE-EPOCH'
phase `set-SOURCE-DATE-EPOCH' succeeded after 0.0 seconds
starting phase `set-paths'
environment variable `PATH' set to `/gnu/store/b3ijxswrcsl3l4406aawbmby4nc0lc0b-autoconf-2.69/bin:/gnu/store/pwnl32gbma9xw5sjyhfv5n25c75bsl1d-automake-1.16.2/bin:/gnu/store/3rs3zyc4886bdp0x4dmfyhpw18w0n9km-pkg-config-0.29.2/bin:/gnu/store/fn4rd9nwwfgkk47i82qjmsqpvp1qk8v4-guile-3.0.2/bin:/gnu/store/am3imbjafa1wdvw9j6qabrxc09w169lz-tar-1.32/bin:/gnu/store/chqjscapsg928dy8pg6yrdhw3ypk8c9x-gzip-1.10/bin:/gnu/store/k3n5jh5579g2b17qmd2w89z2fy45pmr3-bzip2-1.0.8/bin:/gnu/store/k8ksi57ghm301zr0v7aq2vl2fa8hxfqi-xz-5.2.4/bin:/gnu/store/5ckix15mw8r509g68fbm7rla51lmd2zq-file-5.38/bin:/gnu/store/m8fnsfqs18c3srjiaw4frqadb9rqsq16-diffutils-3.7/bin:/gnu/store/2cfnrxy8icrz3sxfn86k0klmvsnj1n82-patch-2.7.6/bin:/gnu/store/0bmzacdzdhi41kkjbsq7iakwjzxkv6fm-findutils-4.7.0/bin:/gnu/store/x9qzb42hmzszg9y16m1gbz3vv54yyi00-gawk-5.0.1/bin:/gnu/store/qy7gpiba7s7ylpfxaay6i76rk892j52n-sed-4.8/bin:/gnu/store/74d5jq5sj2fhy5j0j07jqdclf8nyxgqn-grep-3.4/bin:/gnu/store/wy177cwa387g9kaf3ss716d4fhzb21wx-coreutils-8.32/bin:/gnu/store/wsxnp4k7mp7b705kxp94j7hs8as5fmsl-make-4.3/bin:/gnu/store/7zp9ifpgm3zj481nk6jg1im13g4mza2g-bash-minimal-5.0.16/bin:/gnu/store/y4iy1jvfq07gxynkb9jl1f69jmy349vi-ld-wrapper-0/bin:/gnu/store/1iwrsjwmhcdifc8i3v7qdr59k6gq4z24-binutils-2.34/bin:/gnu/store/z8954h4nvgxwcyy2in8c1l11g199m2yb-gcc-7.5.0/bin:/gnu/store/llkv94k15spryi6zf0gjm0fp7m8k3i8g-glibc-2.31/bin:/gnu/store/llkv94k15spryi6zf0gjm0fp7m8k3i8g-glibc-2.31/sbin'
environment variable `ACLOCAL_PATH' set to `/gnu/store/pwnl32gbma9xw5sjyhfv5n25c75bsl1d-automake-1.16.2/share/aclocal:/gnu/store/3rs3zyc4886bdp0x4dmfyhpw18w0n9km-pkg-config-0.29.2/share/aclocal:/gnu/store/fn4rd9nwwfgkk47i82qjmsqpvp1qk8v4-guile-3.0.2/share/aclocal'
environment variable `PKG_CONFIG_PATH' set to `/gnu/store/fn4rd9nwwfgkk47i82qjmsqpvp1qk8v4-guile-3.0.2/lib/pkgconfig:/gnu/store/k8ksi57ghm301zr0v7aq2vl2fa8hxfqi-xz-5.2.4/lib/pkgconfig:/gnu/store/36c64cqp24i8i8p9m5402ig0pclmcvld-gmp-6.2.0/lib/pkgconfig:/gnu/store/f8dk4p7wlggm2p6jjgpbvri31zacnp5i-libgc-8.0.4/lib/pkgconfig'
environment variable `GUILE_LOAD_PATH' unset
environment variable `GUILE_LOAD_COMPILED_PATH' unset
environment variable `BASH_LOADABLES_PATH' unset
environment variable `C_INCLUDE_PATH' set to `/gnu/store/fn4rd9nwwfgkk47i82qjmsqpvp1qk8v4-guile-3.0.2/include:/gnu/store/ggi94fcdb97561a499wx8y2lxc41cmrm-lzlib-1.12/include:/gnu/store/k3n5jh5579g2b17qmd2w89z2fy45pmr3-bzip2-1.0.8/include:/gnu/store/k8ksi57ghm301zr0v7aq2vl2fa8hxfqi-xz-5.2.4/include:/gnu/store/5ckix15mw8r509g68fbm7rla51lmd2zq-file-5.38/include:/gnu/store/x9qzb42hmzszg9y16m1gbz3vv54yyi00-gawk-5.0.1/include:/gnu/store/wsxnp4k7mp7b705kxp94j7hs8as5fmsl-make-4.3/include:/gnu/store/1iwrsjwmhcdifc8i3v7qdr59k6gq4z24-binutils-2.34/include:/gnu/store/z8954h4nvgxwcyy2in8c1l11g199m2yb-gcc-7.5.0/include:/gnu/store/llkv94k15spryi6zf0gjm0fp7m8k3i8g-glibc-2.31/include:/gnu/store/36c64cqp24i8i8p9m5402ig0pclmcvld-gmp-6.2.0/include:/gnu/store/f8dk4p7wlggm2p6jjgpbvri31zacnp5i-libgc-8.0.4/include:/gnu/store/il1kyhiljxf66lqy4b7sh03y7yl3i1a8-libltdl-2.4.6/include:/gnu/store/kykplfxdjnf44pxn154d8sg30vrpdp2c-libunistring-0.9.10/include:/gnu/store/72z9rxrrmfw1xx9gf27jm2s8h5h0fkh0-linux-libre-headers-5.4.20/include'
environment variable `CPLUS_INCLUDE_PATH' set to `/gnu/store/fn4rd9nwwfgkk47i82qjmsqpvp1qk8v4-guile-3.0.2/include:/gnu/store/ggi94fcdb97561a499wx8y2lxc41cmrm-lzlib-1.12/include:/gnu/store/k3n5jh5579g2b17qmd2w89z2fy45pmr3-bzip2-1.0.8/include:/gnu/store/k8ksi57ghm301zr0v7aq2vl2fa8hxfqi-xz-5.2.4/include:/gnu/store/5ckix15mw8r509g68fbm7rla51lmd2zq-file-5.38/include:/gnu/store/x9qzb42hmzszg9y16m1gbz3vv54yyi00-gawk-5.0.1/include:/gnu/store/wsxnp4k7mp7b705kxp94j7hs8as5fmsl-make-4.3/include:/gnu/store/1iwrsjwmhcdifc8i3v7qdr59k6gq4z24-binutils-2.34/include:/gnu/store/z8954h4nvgxwcyy2in8c1l11g199m2yb-gcc-7.5.0/include/c++:/gnu/store/z8954h4nvgxwcyy2in8c1l11g199m2yb-gcc-7.5.0/include:/gnu/store/llkv94k15spryi6zf0gjm0fp7m8k3i8g-glibc-2.31/include:/gnu/store/36c64cqp24i8i8p9m5402ig0pclmcvld-gmp-6.2.0/include:/gnu/store/f8dk4p7wlggm2p6jjgpbvri31zacnp5i-libgc-8.0.4/include:/gnu/store/il1kyhiljxf66lqy4b7sh03y7yl3i1a8-libltdl-2.4.6/include:/gnu/store/kykplfxdjnf44pxn154d8sg30vrpdp2c-libunistring-0.9.10/include:/gnu/store/72z9rxrrmfw1xx9gf27jm2s8h5h0fkh0-linux-libre-headers-5.4.20/include'
environment variable `LIBRARY_PATH' set to `/gnu/store/fn4rd9nwwfgkk47i82qjmsqpvp1qk8v4-guile-3.0.2/lib:/gnu/store/ggi94fcdb97561a499wx8y2lxc41cmrm-lzlib-1.12/lib:/gnu/store/k3n5jh5579g2b17qmd2w89z2fy45pmr3-bzip2-1.0.8/lib:/gnu/store/k8ksi57ghm301zr0v7aq2vl2fa8hxfqi-xz-5.2.4/lib:/gnu/store/5ckix15mw8r509g68fbm7rla51lmd2zq-file-5.38/lib:/gnu/store/x9qzb42hmzszg9y16m1gbz3vv54yyi00-gawk-5.0.1/lib:/gnu/store/1iwrsjwmhcdifc8i3v7qdr59k6gq4z24-binutils-2.34/lib:/gnu/store/llkv94k15spryi6zf0gjm0fp7m8k3i8g-glibc-2.31/lib:/gnu/store/m4l52mw8m0amgy4j129z5j0syryb7pkg-glibc-2.31-static/lib:/gnu/store/vispxhcwmvasm225pm373jhfn21q1sa1-glibc-utf8-locales-2.31/lib:/gnu/store/36c64cqp24i8i8p9m5402ig0pclmcvld-gmp-6.2.0/lib:/gnu/store/f8dk4p7wlggm2p6jjgpbvri31zacnp5i-libgc-8.0.4/lib:/gnu/store/il1kyhiljxf66lqy4b7sh03y7yl3i1a8-libltdl-2.4.6/lib:/gnu/store/kykplfxdjnf44pxn154d8sg30vrpdp2c-libunistring-0.9.10/lib'
environment variable `GUIX_LOCPATH' set to `/gnu/store/vispxhcwmvasm225pm373jhfn21q1sa1-glibc-utf8-locales-2.31/lib/locale'
phase `set-paths' succeeded after 0.2 seconds
starting phase `install-locale'
using 'en_US.utf8' locale for category "LC_ALL"
phase `install-locale' succeeded after 0.0 seconds
starting phase `unpack'
guile-lzlib/
guile-lzlib/.gitignore
guile-lzlib/AUTHORS
guile-lzlib/COPYING
guile-lzlib/ChangeLog
guile-lzlib/HACKING
guile-lzlib/Makefile.am
guile-lzlib/NEWS
guile-lzlib/README
guile-lzlib/README.org
guile-lzlib/build-aux/
guile-lzlib/build-aux/test-driver.scm
guile-lzlib/configure.ac
guile-lzlib/guix.scm
guile-lzlib/hall.scm
guile-lzlib/lzlib.scm
guile-lzlib/lzlib/
guile-lzlib/lzlib/config.scm
guile-lzlib/lzlib/config.scm.in
guile-lzlib/pre-inst-env.in
guile-lzlib/tests/
guile-lzlib/tests/lzlib.scm
phase `unpack' succeeded after 0.3 seconds
starting phase `bootstrap'
autoreconf: Entering directory `.'
autoreconf: configure.ac: not using Gettext
autoreconf: running: aclocal --force 
autoreconf: configure.ac: tracing
autoreconf: configure.ac: not using Libtool
autoreconf: running: /gnu/store/b3ijxswrcsl3l4406aawbmby4nc0lc0b-autoconf-2.69/bin/autoconf --force
autoreconf: configure.ac: not using Autoheader
autoreconf: running: automake --add-missing --copy --force-missing
configure.ac:51: installing 'build-aux/compile'
configure.ac:8: installing 'build-aux/install-sh'
configure.ac:8: installing 'build-aux/missing'
Makefile.am: installing './INSTALL'
autoreconf: Leaving directory `.'
phase `bootstrap' succeeded after 26.9 seconds
starting phase `patch-usr-bin-file'
phase `patch-usr-bin-file' succeeded after 0.2 seconds
starting phase `patch-source-shebangs'
patch-shebang: ./build-aux/compile: changing `/bin/sh' to `/gnu/store/7zp9ifpgm3zj481nk6jg1im13g4mza2g-bash-minimal-5.0.16/bin/sh'
patch-shebang: ./build-aux/install-sh: changing `/bin/sh' to `/gnu/store/7zp9ifpgm3zj481nk6jg1im13g4mza2g-bash-minimal-5.0.16/bin/sh'
patch-shebang: ./build-aux/missing: changing `/bin/sh' to `/gnu/store/7zp9ifpgm3zj481nk6jg1im13g4mza2g-bash-minimal-5.0.16/bin/sh'
patch-shebang: ./configure: changing `/bin/sh' to `/gnu/store/7zp9ifpgm3zj481nk6jg1im13g4mza2g-bash-minimal-5.0.16/bin/sh'
phase `patch-source-shebangs' succeeded after 0.0 seconds
starting phase `configure'
source directory: "/tmp/guix-build-guile-lzlib-0.0.2.drv-0/guile-lzlib" (relative from build: ".")
build directory: "/tmp/guix-build-guile-lzlib-0.0.2.drv-0/guile-lzlib"
configure flags: ("CONFIG_SHELL=/gnu/store/7zp9ifpgm3zj481nk6jg1im13g4mza2g-bash-minimal-5.0.16/bin/bash" "SHELL=/gnu/store/7zp9ifpgm3zj481nk6jg1im13g4mza2g-bash-minimal-5.0.16/bin/bash" "--prefix=/gnu/store/1cfbihr300czn4vhvycxsw1a2fx2x3yl-guile-lzlib-0.0.2" "--enable-fast-install" "--build=arm-unknown-linux-gnueabihf")
configure: WARNING: unrecognized options: --enable-fast-install
checking for a BSD-compatible install... /gnu/store/wy177cwa387g9kaf3ss716d4fhzb21wx-coreutils-8.32/bin/install -c
checking whether build environment is sane... yes
checking for a thread-safe mkdir -p... /gnu/store/wy177cwa387g9kaf3ss716d4fhzb21wx-coreutils-8.32/bin/mkdir -p
checking for gawk... gawk
checking whether make sets $(MAKE)... no
checking whether make supports nested variables... yes
checking whether make supports nested variables... (cached) yes
checking for pkg-config... /gnu/store/3rs3zyc4886bdp0x4dmfyhpw18w0n9km-pkg-config-0.29.2/bin/pkg-config
checking pkg-config is at least version 0.9.0... yes
configure: checking for guile 3.0
configure: found guile 3.0
checking for guile-3.0... no
checking for guile3.0... no
checking for guile-3... no
checking for guile3... no
checking for guile... /gnu/store/fn4rd9nwwfgkk47i82qjmsqpvp1qk8v4-guile-3.0.2/bin/guile
checking for Guile version >= 3.0... 3.0.2
checking for guild... /gnu/store/fn4rd9nwwfgkk47i82qjmsqpvp1qk8v4-guile-3.0.2/bin/guild
checking for guile-config... /gnu/store/fn4rd9nwwfgkk47i82qjmsqpvp1qk8v4-guile-3.0.2/bin/guile-config
checking for Guile site directory... /gnu/store/fn4rd9nwwfgkk47i82qjmsqpvp1qk8v4-guile-3.0.2/share/guile/site/3.0
checking for Guile site-ccache directory using pkgconfig... /gnu/store/fn4rd9nwwfgkk47i82qjmsqpvp1qk8v4-guile-3.0.2/lib/guile/3.0/site-ccache
checking for Guile extensions directory... /gnu/store/fn4rd9nwwfgkk47i82qjmsqpvp1qk8v4-guile-3.0.2/lib/guile/3.0/extensions
checking whether make supports the include directive... yes (GNU style)
checking for gcc... gcc
checking whether the C compiler works... yes
checking for C compiler default output file name... a.out
checking for suffix of executables... 
checking whether we are cross compiling... no
checking for suffix of object files... o
checking whether we are using the GNU C compiler... yes
checking whether gcc accepts -g... yes
checking for gcc option to accept ISO C89... none needed
checking whether gcc understands -c and -o together... yes
checking dependency style of gcc... none
checking lzlib's file name... 
checking that generated files are newer than configure... done
configure: creating ./config.status
config.status: creating Makefile
config.status: creating lzlib/config.scm
config.status: creating pre-inst-env
config.status: executing depfiles commands
configure: WARNING: unrecognized options: --enable-fast-install
phase `configure' succeeded after 24.9 seconds
starting phase `patch-generated-file-shebangs'
phase `patch-generated-file-shebangs' succeeded after 0.1 seconds
starting phase `build'
  GEN      lzlib/config.go
  GEN      lzlib.go
wrote `lzlib/config.go'
wrote `lzlib.go'
phase `build' succeeded after 18.0 seconds
starting phase `check'
make  check-TESTS
make[1]: Entering directory '/tmp/guix-build-guile-lzlib-0.0.2.drv-0/guile-lzlib'
make[2]: Entering directory '/tmp/guix-build-guile-lzlib-0.0.2.drv-0/guile-lzlib'
FAIL: tests/lzlib.scm
============================================================================
Testsuite summary for guile-lzlib 0.2
============================================================================
# TOTAL: 12
# PASS:  0
# SKIP:  0
# XFAIL: 0
# FAIL:  12
# XPASS: 0
# ERROR: 0
============================================================================
See ./test-suite.log
============================================================================
make[2]: *** [Makefile:720: test-suite.log] Error 1
make[2]: Leaving directory '/tmp/guix-build-guile-lzlib-0.0.2.drv-0/guile-lzlib'
make[1]: *** [Makefile:828: check-TESTS] Error 2
make[1]: Leaving directory '/tmp/guix-build-guile-lzlib-0.0.2.drv-0/guile-lzlib'
make: *** [Makefile:1033: check-am] Error 2

Test suite failed, dumping logs.

--- ./test-suite.log --------------------------------------------------------

=======================================
   guile-lzlib 0.2: ./test-suite.log
=======================================

# TOTAL: 12
# PASS:  0
# SKIP:  0
# XFAIL: 0
# FAIL:  12
# XPASS: 0
# ERROR: 0

.. contents:: :depth: 2

FAIL: tests/lzlib
=================

test-name: null bytevector
location: /tmp/guix-build-guile-lzlib-0.0.2.drv-0/guile-lzlib/tests/lzlib.scm:86
source:
+ (test-assert
+   "null bytevector"
+   (compress-and-decompress
+     (make-bytevector (+ (random 100000) (* 20 1024)))))

;;; ("Uncompressed bytes:" 71101)
random seed for tests: 1612127558
test-name: null bytevector
location: /tmp/guix-build-guile-lzlib-0.0.2.drv-0/guile-lzlib/tests/lzlib.scm:86
source:
+ (test-assert
+   "null bytevector"
+   (compress-and-decompress
+     (make-bytevector (+ (random 100000) (* 20 1024)))))

;;; ("Uncompressed bytes:" 71101)
actual-value: #f
actual-error:
+ (wrong-type-arg
+   #f
+   "Wrong type to apply: ~S"
+   (#f)
+   (#f))
result: FAIL

test-name: random bytevector
location: /tmp/guix-build-guile-lzlib-0.0.2.drv-0/guile-lzlib/tests/lzlib.scm:90
source:
+ (test-assert
+   "random bytevector"
+   (compress-and-decompress
+     (random-bytevector
+       (+ (random 100000) (* 20 1024)))))

;;; ("Uncompressed bytes:" 98099)
random seed for tests: 1612127558
test-name: null bytevector
location: /tmp/guix-build-guile-lzlib-0.0.2.drv-0/guile-lzlib/tests/lzlib.scm:86
source:
+ (test-assert
+   "null bytevector"
+   (compress-and-decompress
+     (make-bytevector (+ (random 100000) (* 20 1024)))))

;;; ("Uncompressed bytes:" 71101)
actual-value: #f
actual-error:
+ (wrong-type-arg
+   #f
+   "Wrong type to apply: ~S"
+   (#f)
+   (#f))
result: FAIL

test-name: random bytevector
location: /tmp/guix-build-guile-lzlib-0.0.2.drv-0/guile-lzlib/tests/lzlib.scm:90
source:
+ (test-assert
+   "random bytevector"
+   (compress-and-decompress
+     (random-bytevector
+       (+ (random 100000) (* 20 1024)))))

;;; ("Uncompressed bytes:" 98099)
actual-value: #f
actual-error:
+ (wrong-type-arg
+   #f
+   "Wrong type to apply: ~S"
+   (#f)
+   (#f))
result: FAIL

test-name: small bytevector
location: /tmp/guix-build-guile-lzlib-0.0.2.drv-0/guile-lzlib/tests/lzlib.scm:93
source:
+ (test-assert
+   "small bytevector"
+   (compress-and-decompress (random-bytevector 127)))

;;; ("Uncompressed bytes:" 127)
random seed for tests: 1612127558
test-name: null bytevector
location: /tmp/guix-build-guile-lzlib-0.0.2.drv-0/guile-lzlib/tests/lzlib.scm:86
source:
+ (test-assert
+   "null bytevector"
+   (compress-and-decompress
+     (make-bytevector (+ (random 100000) (* 20 1024)))))

;;; ("Uncompressed bytes:" 71101)
actual-value: #f
actual-error:
+ (wrong-type-arg
+   #f
+   "Wrong type to apply: ~S"
+   (#f)
+   (#f))
result: FAIL

test-name: random bytevector
location: /tmp/guix-build-guile-lzlib-0.0.2.drv-0/guile-lzlib/tests/lzlib.scm:90
source:
+ (test-assert
+   "random bytevector"
+   (compress-and-decompress
+     (random-bytevector
+       (+ (random 100000) (* 20 1024)))))

;;; ("Uncompressed bytes:" 98099)
actual-value: #f
actual-error:
+ (wrong-type-arg
+   #f
+   "Wrong type to apply: ~S"
+   (#f)
+   (#f))
result: FAIL

test-name: small bytevector
location: /tmp/guix-build-guile-lzlib-0.0.2.drv-0/guile-lzlib/tests/lzlib.scm:93
source:
+ (test-assert
+   "small bytevector"
+   (compress-and-decompress (random-bytevector 127)))

;;; ("Uncompressed bytes:" 127)
actual-value: #f
actual-error:
+ (wrong-type-arg
+   #f
+   "Wrong type to apply: ~S"
+   (#f)
+   (#f))
result: FAIL

test-name: 1 bytevector
location: /tmp/guix-build-guile-lzlib-0.0.2.drv-0/guile-lzlib/tests/lzlib.scm:96
source:
+ (test-assert
+   "1 bytevector"
+   (compress-and-decompress (random-bytevector 1)))

;;; ("Uncompressed bytes:" 1)
random seed for tests: 1612127558
test-name: null bytevector
location: /tmp/guix-build-guile-lzlib-0.0.2.drv-0/guile-lzlib/tests/lzlib.scm:86
source:
+ (test-assert
+   "null bytevector"
+   (compress-and-decompress
+     (make-bytevector (+ (random 100000) (* 20 1024)))))

;;; ("Uncompressed bytes:" 71101)
actual-value: #f
actual-error:
+ (wrong-type-arg
+   #f
+   "Wrong type to apply: ~S"
+   (#f)
+   (#f))
result: FAIL

test-name: random bytevector
location: /tmp/guix-build-guile-lzlib-0.0.2.drv-0/guile-lzlib/tests/lzlib.scm:90
source:
+ (test-assert
+   "random bytevector"
+   (compress-and-decompress
+     (random-bytevector
+       (+ (random 100000) (* 20 1024)))))

;;; ("Uncompressed bytes:" 98099)
actual-value: #f
actual-error:
+ (wrong-type-arg
+   #f
+   "Wrong type to apply: ~S"
+   (#f)
+   (#f))
result: FAIL

test-name: small bytevector
location: /tmp/guix-build-guile-lzlib-0.0.2.drv-0/guile-lzlib/tests/lzlib.scm:93
source:
+ (test-assert
+   "small bytevector"
+   (compress-and-decompress (random-bytevector 127)))

;;; ("Uncompressed bytes:" 127)
actual-value: #f
actual-error:
+ (wrong-type-arg
+   #f
+   "Wrong type to apply: ~S"
+   (#f)
+   (#f))
result: FAIL

test-name: 1 bytevector
location: /tmp/guix-build-guile-lzlib-0.0.2.drv-0/guile-lzlib/tests/lzlib.scm:96
source:
+ (test-assert
+   "1 bytevector"
+   (compress-and-decompress (random-bytevector 1)))

;;; ("Uncompressed bytes:" 1)
actual-value: #f
actual-error:
+ (wrong-type-arg
+   #f
+   "Wrong type to apply: ~S"
+   (#f)
+   (#f))
result: FAIL

test-name: Bytevector of size relative to Lzip internal buffers (2 * dictionary)
location: /tmp/guix-build-guile-lzlib-0.0.2.drv-0/guile-lzlib/tests/lzlib.scm:99
source:
+ (test-assert
+   "Bytevector of size relative to Lzip internal buffers (2 * dictionary)"
+   (compress-and-decompress
+     (random-bytevector
+       (* 2
+          (dictionary-size+match-length-limit
+            %default-compression-level)))))

;;; ("Uncompressed bytes:" 16777216)
random seed for tests: 1612127558
test-name: null bytevector
location: /tmp/guix-build-guile-lzlib-0.0.2.drv-0/guile-lzlib/tests/lzlib.scm:86
source:
+ (test-assert
+   "null bytevector"
+   (compress-and-decompress
+     (make-bytevector (+ (random 100000) (* 20 1024)))))

;;; ("Uncompressed bytes:" 71101)
actual-value: #f
actual-error:
+ (wrong-type-arg
+   #f
+   "Wrong type to apply: ~S"
+   (#f)
+   (#f))
result: FAIL

test-name: random bytevector
location: /tmp/guix-build-guile-lzlib-0.0.2.drv-0/guile-lzlib/tests/lzlib.scm:90
source:
+ (test-assert
+   "random bytevector"
+   (compress-and-decompress
+     (random-bytevector
+       (+ (random 100000) (* 20 1024)))))

;;; ("Uncompressed bytes:" 98099)
actual-value: #f
actual-error:
+ (wrong-type-arg
+   #f
+   "Wrong type to apply: ~S"
+   (#f)
+   (#f))
result: FAIL

test-name: small bytevector
location: /tmp/guix-build-guile-lzlib-0.0.2.drv-0/guile-lzlib/tests/lzlib.scm:93
source:
+ (test-assert
+   "small bytevector"
+   (compress-and-decompress (random-bytevector 127)))

;;; ("Uncompressed bytes:" 127)
actual-value: #f
actual-error:
+ (wrong-type-arg
+   #f
+   "Wrong type to apply: ~S"
+   (#f)
+   (#f))
result: FAIL

test-name: 1 bytevector
location: /tmp/guix-build-guile-lzlib-0.0.2.drv-0/guile-lzlib/tests/lzlib.scm:96
source:
+ (test-assert
+   "1 bytevector"
+   (compress-and-decompress (random-bytevector 1)))

;;; ("Uncompressed bytes:" 1)
actual-value: #f
actual-error:
+ (wrong-type-arg
+   #f
+   "Wrong type to apply: ~S"
+   (#f)
+   (#f))
result: FAIL

test-name: Bytevector of size relative to Lzip internal buffers (2 * dictionary)
location: /tmp/guix-build-guile-lzlib-0.0.2.drv-0/guile-lzlib/tests/lzlib.scm:99
source:
+ (test-assert
+   "Bytevector of size relative to Lzip internal buffers (2 * dictionary)"
+   (compress-and-decompress
+     (random-bytevector
+       (* 2
+          (dictionary-size+match-length-limit
+            %default-compression-level)))))

;;; ("Uncompressed bytes:" 16777216)
actual-value: #f
actual-error:
+ (wrong-type-arg
+   #f
+   "Wrong type to apply: ~S"
+   (#f)
+   (#f))
result: FAIL

test-name: Bytevector of size relative to Lzip internal buffers (64KiB)
location: /tmp/guix-build-guile-lzlib-0.0.2.drv-0/guile-lzlib/tests/lzlib.scm:104
source:
+ (test-assert
+   "Bytevector of size relative to Lzip internal buffers (64KiB)"
+   (compress-and-decompress
+     (random-bytevector (* 64 1024))))

;;; ("Uncompressed bytes:" 65536)
random seed for tests: 1612127558
test-name: null bytevector
location: /tmp/guix-build-guile-lzlib-0.0.2.drv-0/guile-lzlib/tests/lzlib.scm:86
source:
+ (test-assert
+   "null bytevector"
+   (compress-and-decompress
+     (make-bytevector (+ (random 100000) (* 20 1024)))))

;;; ("Uncompressed bytes:" 71101)
actual-value: #f
actual-error:
+ (wrong-type-arg
+   #f
+   "Wrong type to apply: ~S"
+   (#f)
+   (#f))
result: FAIL

test-name: random bytevector
location: /tmp/guix-build-guile-lzlib-0.0.2.drv-0/guile-lzlib/tests/lzlib.scm:90
source:
+ (test-assert
+   "random bytevector"
+   (compress-and-decompress
+     (random-bytevector
+       (+ (random 100000) (* 20 1024)))))

;;; ("Uncompressed bytes:" 98099)
actual-value: #f
actual-error:
+ (wrong-type-arg
+   #f
+   "Wrong type to apply: ~S"
+   (#f)
+   (#f))
result: FAIL

test-name: small bytevector
location: /tmp/guix-build-guile-lzlib-0.0.2.drv-0/guile-lzlib/tests/lzlib.scm:93
source:
+ (test-assert
+   "small bytevector"
+   (compress-and-decompress (random-bytevector 127)))

;;; ("Uncompressed bytes:" 127)
actual-value: #f
actual-error:
+ (wrong-type-arg
+   #f
+   "Wrong type to apply: ~S"
+   (#f)
+   (#f))
result: FAIL

test-name: 1 bytevector
location: /tmp/guix-build-guile-lzlib-0.0.2.drv-0/guile-lzlib/tests/lzlib.scm:96
source:
+ (test-assert
+   "1 bytevector"
+   (compress-and-decompress (random-bytevector 1)))

;;; ("Uncompressed bytes:" 1)
actual-value: #f
actual-error:
+ (wrong-type-arg
+   #f
+   "Wrong type to apply: ~S"
+   (#f)
+   (#f))
result: FAIL

test-name: Bytevector of size relative to Lzip internal buffers (2 * dictionary)
location: /tmp/guix-build-guile-lzlib-0.0.2.drv-0/guile-lzlib/tests/lzlib.scm:99
source:
+ (test-assert
+   "Bytevector of size relative to Lzip internal buffers (2 * dictionary)"
+   (compress-and-decompress
+     (random-bytevector
+       (* 2
+          (dictionary-size+match-length-limit
+            %default-compression-level)))))

;;; ("Uncompressed bytes:" 16777216)
actual-value: #f
actual-error:
+ (wrong-type-arg
+   #f
+   "Wrong type to apply: ~S"
+   (#f)
+   (#f))
result: FAIL

test-name: Bytevector of size relative to Lzip internal buffers (64KiB)
location: /tmp/guix-build-guile-lzlib-0.0.2.drv-0/guile-lzlib/tests/lzlib.scm:104
source:
+ (test-assert
+   "Bytevector of size relative to Lzip internal buffers (64KiB)"
+   (compress-and-decompress
+     (random-bytevector (* 64 1024))))

;;; ("Uncompressed bytes:" 65536)
actual-value: #f
actual-error:
+ (wrong-type-arg
+   #f
+   "Wrong type to apply: ~S"
+   (#f)
+   (#f))
result: FAIL

test-name: Bytevector of size relative to Lzip internal buffers (64KiB-1)
location: /tmp/guix-build-guile-lzlib-0.0.2.drv-0/guile-lzlib/tests/lzlib.scm:107
source:
+ (test-assert
+   "Bytevector of size relative to Lzip internal buffers (64KiB-1)"
+   (compress-and-decompress
+     (random-bytevector (#{1-}# (* 64 1024)))))

;;; ("Uncompressed bytes:" 65535)
random seed for tests: 1612127558
test-name: null bytevector
location: /tmp/guix-build-guile-lzlib-0.0.2.drv-0/guile-lzlib/tests/lzlib.scm:86
source:
+ (test-assert
+   "null bytevector"
+   (compress-and-decompress
+     (make-bytevector (+ (random 100000) (* 20 1024)))))

;;; ("Uncompressed bytes:" 71101)
actual-value: #f
actual-error:
+ (wrong-type-arg
+   #f
+   "Wrong type to apply: ~S"
+   (#f)
+   (#f))
result: FAIL

test-name: random bytevector
location: /tmp/guix-build-guile-lzlib-0.0.2.drv-0/guile-lzlib/tests/lzlib.scm:90
source:
+ (test-assert
+   "random bytevector"
+   (compress-and-decompress
+     (random-bytevector
+       (+ (random 100000) (* 20 1024)))))

;;; ("Uncompressed bytes:" 98099)
actual-value: #f
actual-error:
+ (wrong-type-arg
+   #f
+   "Wrong type to apply: ~S"
+   (#f)
+   (#f))
result: FAIL

test-name: small bytevector
location: /tmp/guix-build-guile-lzlib-0.0.2.drv-0/guile-lzlib/tests/lzlib.scm:93
source:
+ (test-assert
+   "small bytevector"
+   (compress-and-decompress (random-bytevector 127)))

;;; ("Uncompressed bytes:" 127)
actual-value: #f
actual-error:
+ (wrong-type-arg
+   #f
+   "Wrong type to apply: ~S"
+   (#f)
+   (#f))
result: FAIL

test-name: 1 bytevector
location: /tmp/guix-build-guile-lzlib-0.0.2.drv-0/guile-lzlib/tests/lzlib.scm:96
source:
+ (test-assert
+   "1 bytevector"
+   (compress-and-decompress (random-bytevector 1)))

;;; ("Uncompressed bytes:" 1)
actual-value: #f
actual-error:
+ (wrong-type-arg
+   #f
+   "Wrong type to apply: ~S"
+   (#f)
+   (#f))
result: FAIL

test-name: Bytevector of size relative to Lzip internal buffers (2 * dictionary)
location: /tmp/guix-build-guile-lzlib-0.0.2.drv-0/guile-lzlib/tests/lzlib.scm:99
source:
+ (test-assert
+   "Bytevector of size relative to Lzip internal buffers (2 * dictionary)"
+   (compress-and-decompress
+     (random-bytevector
+       (* 2
+          (dictionary-size+match-length-limit
+            %default-compression-level)))))

;;; ("Uncompressed bytes:" 16777216)
actual-value: #f
actual-error:
+ (wrong-type-arg
+   #f
+   "Wrong type to apply: ~S"
+   (#f)
+   (#f))
result: FAIL

test-name: Bytevector of size relative to Lzip internal buffers (64KiB)
location: /tmp/guix-build-guile-lzlib-0.0.2.drv-0/guile-lzlib/tests/lzlib.scm:104
source:
+ (test-assert
+   "Bytevector of size relative to Lzip internal buffers (64KiB)"
+   (compress-and-decompress
+     (random-bytevector (* 64 1024))))

;;; ("Uncompressed bytes:" 65536)
actual-value: #f
actual-error:
+ (wrong-type-arg
+   #f
+   "Wrong type to apply: ~S"
+   (#f)
+   (#f))
result: FAIL

test-name: Bytevector of size relative to Lzip internal buffers (64KiB-1)
location: /tmp/guix-build-guile-lzlib-0.0.2.drv-0/guile-lzlib/tests/lzlib.scm:107
source:
+ (test-assert
+   "Bytevector of size relative to Lzip internal buffers (64KiB-1)"
+   (compress-and-decompress
+     (random-bytevector (#{1-}# (* 64 1024)))))

;;; ("Uncompressed bytes:" 65535)
actual-value: #f
actual-error:
+ (wrong-type-arg
+   #f
+   "Wrong type to apply: ~S"
+   (#f)
+   (#f))
result: FAIL

test-name: Bytevector of size relative to Lzip internal buffers (64KiB+1)
location: /tmp/guix-build-guile-lzlib-0.0.2.drv-0/guile-lzlib/tests/lzlib.scm:110
source:
+ (test-assert
+   "Bytevector of size relative to Lzip internal buffers (64KiB+1)"
+   (compress-and-decompress
+     (random-bytevector (#{1+}# (* 64 1024)))))

;;; ("Uncompressed bytes:" 65537)
random seed for tests: 1612127558
test-name: null bytevector
location: /tmp/guix-build-guile-lzlib-0.0.2.drv-0/guile-lzlib/tests/lzlib.scm:86
source:
+ (test-assert
+   "null bytevector"
+   (compress-and-decompress
+     (make-bytevector (+ (random 100000) (* 20 1024)))))

;;; ("Uncompressed bytes:" 71101)
actual-value: #f
actual-error:
+ (wrong-type-arg
+   #f
+   "Wrong type to apply: ~S"
+   (#f)
+   (#f))
result: FAIL

test-name: random bytevector
location: /tmp/guix-build-guile-lzlib-0.0.2.drv-0/guile-lzlib/tests/lzlib.scm:90
source:
+ (test-assert
+   "random bytevector"
+   (compress-and-decompress
+     (random-bytevector
+       (+ (random 100000) (* 20 1024)))))

;;; ("Uncompressed bytes:" 98099)
actual-value: #f
actual-error:
+ (wrong-type-arg
+   #f
+   "Wrong type to apply: ~S"
+   (#f)
+   (#f))
result: FAIL

test-name: small bytevector
location: /tmp/guix-build-guile-lzlib-0.0.2.drv-0/guile-lzlib/tests/lzlib.scm:93
source:
+ (test-assert
+   "small bytevector"
+   (compress-and-decompress (random-bytevector 127)))

;;; ("Uncompressed bytes:" 127)
actual-value: #f
actual-error:
+ (wrong-type-arg
+   #f
+   "Wrong type to apply: ~S"
+   (#f)
+   (#f))
result: FAIL

test-name: 1 bytevector
location: /tmp/guix-build-guile-lzlib-0.0.2.drv-0/guile-lzlib/tests/lzlib.scm:96
source:
+ (test-assert
+   "1 bytevector"
+   (compress-and-decompress (random-bytevector 1)))

;;; ("Uncompressed bytes:" 1)
actual-value: #f
actual-error:
+ (wrong-type-arg
+   #f
+   "Wrong type to apply: ~S"
+   (#f)
+   (#f))
result: FAIL

test-name: Bytevector of size relative to Lzip internal buffers (2 * dictionary)
location: /tmp/guix-build-guile-lzlib-0.0.2.drv-0/guile-lzlib/tests/lzlib.scm:99
source:
+ (test-assert
+   "Bytevector of size relative to Lzip internal buffers (2 * dictionary)"
+   (compress-and-decompress
+     (random-bytevector
+       (* 2
+          (dictionary-size+match-length-limit
+            %default-compression-level)))))

;;; ("Uncompressed bytes:" 16777216)
actual-value: #f
actual-error:
+ (wrong-type-arg
+   #f
+   "Wrong type to apply: ~S"
+   (#f)
+   (#f))
result: FAIL

test-name: Bytevector of size relative to Lzip internal buffers (64KiB)
location: /tmp/guix-build-guile-lzlib-0.0.2.drv-0/guile-lzlib/tests/lzlib.scm:104
source:
+ (test-assert
+   "Bytevector of size relative to Lzip internal buffers (64KiB)"
+   (compress-and-decompress
+     (random-bytevector (* 64 1024))))

;;; ("Uncompressed bytes:" 65536)
actual-value: #f
actual-error:
+ (wrong-type-arg
+   #f
+   "Wrong type to apply: ~S"
+   (#f)
+   (#f))
result: FAIL

test-name: Bytevector of size relative to Lzip internal buffers (64KiB-1)
location: /tmp/guix-build-guile-lzlib-0.0.2.drv-0/guile-lzlib/tests/lzlib.scm:107
source:
+ (test-assert
+   "Bytevector of size relative to Lzip internal buffers (64KiB-1)"
+   (compress-and-decompress
+     (random-bytevector (#{1-}# (* 64 1024)))))

;;; ("Uncompressed bytes:" 65535)
actual-value: #f
actual-error:
+ (wrong-type-arg
+   #f
+   "Wrong type to apply: ~S"
+   (#f)
+   (#f))
result: FAIL

test-name: Bytevector of size relative to Lzip internal buffers (64KiB+1)
location: /tmp/guix-build-guile-lzlib-0.0.2.drv-0/guile-lzlib/tests/lzlib.scm:110
source:
+ (test-assert
+   "Bytevector of size relative to Lzip internal buffers (64KiB+1)"
+   (compress-and-decompress
+     (random-bytevector (#{1+}# (* 64 1024)))))

;;; ("Uncompressed bytes:" 65537)
actual-value: #f
actual-error:
+ (wrong-type-arg
+   #f
+   "Wrong type to apply: ~S"
+   (#f)
+   (#f))
result: FAIL

test-name: Bytevector of size relative to Lzip internal buffers (1MiB)
location: /tmp/guix-build-guile-lzlib-0.0.2.drv-0/guile-lzlib/tests/lzlib.scm:113
source:
+ (test-assert
+   "Bytevector of size relative to Lzip internal buffers (1MiB)"
+   (compress-and-decompress
+     (random-bytevector (* 1024 1024))))

;;; ("Uncompressed bytes:" 1048576)
random seed for tests: 1612127558
test-name: null bytevector
location: /tmp/guix-build-guile-lzlib-0.0.2.drv-0/guile-lzlib/tests/lzlib.scm:86
source:
+ (test-assert
+   "null bytevector"
+   (compress-and-decompress
+     (make-bytevector (+ (random 100000) (* 20 1024)))))

;;; ("Uncompressed bytes:" 71101)
actual-value: #f
actual-error:
+ (wrong-type-arg
+   #f
+   "Wrong type to apply: ~S"
+   (#f)
+   (#f))
result: FAIL

test-name: random bytevector
location: /tmp/guix-build-guile-lzlib-0.0.2.drv-0/guile-lzlib/tests/lzlib.scm:90
source:
+ (test-assert
+   "random bytevector"
+   (compress-and-decompress
+     (random-bytevector
+       (+ (random 100000) (* 20 1024)))))

;;; ("Uncompressed bytes:" 98099)
actual-value: #f
actual-error:
+ (wrong-type-arg
+   #f
+   "Wrong type to apply: ~S"
+   (#f)
+   (#f))
result: FAIL

test-name: small bytevector
location: /tmp/guix-build-guile-lzlib-0.0.2.drv-0/guile-lzlib/tests/lzlib.scm:93
source:
+ (test-assert
+   "small bytevector"
+   (compress-and-decompress (random-bytevector 127)))

;;; ("Uncompressed bytes:" 127)
actual-value: #f
actual-error:
+ (wrong-type-arg
+   #f
+   "Wrong type to apply: ~S"
+   (#f)
+   (#f))
result: FAIL

test-name: 1 bytevector
location: /tmp/guix-build-guile-lzlib-0.0.2.drv-0/guile-lzlib/tests/lzlib.scm:96
source:
+ (test-assert
+   "1 bytevector"
+   (compress-and-decompress (random-bytevector 1)))

;;; ("Uncompressed bytes:" 1)
actual-value: #f
actual-error:
+ (wrong-type-arg
+   #f
+   "Wrong type to apply: ~S"
+   (#f)
+   (#f))
result: FAIL

test-name: Bytevector of size relative to Lzip internal buffers (2 * dictionary)
location: /tmp/guix-build-guile-lzlib-0.0.2.drv-0/guile-lzlib/tests/lzlib.scm:99
source:
+ (test-assert
+   "Bytevector of size relative to Lzip internal buffers (2 * dictionary)"
+   (compress-and-decompress
+     (random-bytevector
+       (* 2
+          (dictionary-size+match-length-limit
+            %default-compression-level)))))

;;; ("Uncompressed bytes:" 16777216)
actual-value: #f
actual-error:
+ (wrong-type-arg
+   #f
+   "Wrong type to apply: ~S"
+   (#f)
+   (#f))
result: FAIL

test-name: Bytevector of size relative to Lzip internal buffers (64KiB)
location: /tmp/guix-build-guile-lzlib-0.0.2.drv-0/guile-lzlib/tests/lzlib.scm:104
source:
+ (test-assert
+   "Bytevector of size relative to Lzip internal buffers (64KiB)"
+   (compress-and-decompress
+     (random-bytevector (* 64 1024))))

;;; ("Uncompressed bytes:" 65536)
actual-value: #f
actual-error:
+ (wrong-type-arg
+   #f
+   "Wrong type to apply: ~S"
+   (#f)
+   (#f))
result: FAIL

test-name: Bytevector of size relative to Lzip internal buffers (64KiB-1)
location: /tmp/guix-build-guile-lzlib-0.0.2.drv-0/guile-lzlib/tests/lzlib.scm:107
source:
+ (test-assert
+   "Bytevector of size relative to Lzip internal buffers (64KiB-1)"
+   (compress-and-decompress
+     (random-bytevector (#{1-}# (* 64 1024)))))

;;; ("Uncompressed bytes:" 65535)
actual-value: #f
actual-error:
+ (wrong-type-arg
+   #f
+   "Wrong type to apply: ~S"
+   (#f)
+   (#f))
result: FAIL

test-name: Bytevector of size relative to Lzip internal buffers (64KiB+1)
location: /tmp/guix-build-guile-lzlib-0.0.2.drv-0/guile-lzlib/tests/lzlib.scm:110
source:
+ (test-assert
+   "Bytevector of size relative to Lzip internal buffers (64KiB+1)"
+   (compress-and-decompress
+     (random-bytevector (#{1+}# (* 64 1024)))))

;;; ("Uncompressed bytes:" 65537)
actual-value: #f
actual-error:
+ (wrong-type-arg
+   #f
+   "Wrong type to apply: ~S"
+   (#f)
+   (#f))
result: FAIL

test-name: Bytevector of size relative to Lzip internal buffers (1MiB)
location: /tmp/guix-build-guile-lzlib-0.0.2.drv-0/guile-lzlib/tests/lzlib.scm:113
source:
+ (test-assert
+   "Bytevector of size relative to Lzip internal buffers (1MiB)"
+   (compress-and-decompress
+     (random-bytevector (* 1024 1024))))

;;; ("Uncompressed bytes:" 1048576)
actual-value: #f
actual-error:
+ (wrong-type-arg
+   #f
+   "Wrong type to apply: ~S"
+   (#f)
+   (#f))
result: FAIL

test-name: Bytevector of size relative to Lzip internal buffers (1MiB-1)
location: /tmp/guix-build-guile-lzlib-0.0.2.drv-0/guile-lzlib/tests/lzlib.scm:116
source:
+ (test-assert
+   "Bytevector of size relative to Lzip internal buffers (1MiB-1)"
+   (compress-and-decompress
+     (random-bytevector (#{1-}# (* 1024 1024)))))

;;; ("Uncompressed bytes:" 1048575)
random seed for tests: 1612127558
/tmp/guix-build-guile-lzlib-0.0.2.drv-0/guile-lzlib/tests/lzlib.scm:116
source:
+ (test-assert
+   "Bytevector of size relative to Lzip internal buffers (1MiB-1)"
+   (compress-and-decompress
+     (random-bytevector (#{1-}# (* 1024 1024)))))

;;; ("Uncompressed bytes:" 1048575)
actual-value: #f
actual-error:
+ (wrong-type-arg
+   #f
+   "Wrong type to apply: ~S"
+   (#f)
+   (#f))
result: FAIL

test-name: Bytevector of size relative to Lzip internal buffers (1MiB+1)
location: /tmp/guix-build-guile-lzlib-0.0.2.drv-0/guile-lzlib/tests/lzlib.scm:119
source:
+ (test-assert
+   "Bytevector of size relative to Lzip internal buffers (1MiB+1)"
+   (compress-and-decompress
+     (random-bytevector (#{1+}# (* 1024 1024)))))

;;; ("Uncompressed bytes:" 1048577)
random seed for tests: 1612127558
/tmp/guix-build-guile-lzlib-0.0.2.drv-0/guile-lzlib/tests/lzlib.scm:116
source:
+ (test-assert
+   "Bytevector of size relative to Lzip internal buffers (1MiB-1)"
+   (compress-and-decompress
+     (random-bytevector (#{1-}# (* 1024 1024)))))

;;; ("Uncompressed bytes:" 1048575)
actual-value: #f
actual-error:
+ (wrong-type-arg
+   #f
+   "Wrong type to apply: ~S"
+   (#f)
+   (#f))
result: FAIL

test-name: Bytevector of size relative to Lzip internal buffers (1MiB+1)
location: /tmp/guix-build-guile-lzlib-0.0.2.drv-0/guile-lzlib/tests/lzlib.scm:119
source:
+ (test-assert
+   "Bytevector of size relative to Lzip internal buffers (1MiB+1)"
+   (compress-and-decompress
+     (random-bytevector (#{1+}# (* 1024 1024)))))

;;; ("Uncompressed bytes:" 1048577)
actual-value: #f
actual-error:
+ (wrong-type-arg
+   #f
+   "Wrong type to apply: ~S"
+   (#f)
+   (#f))
result: FAIL

test-name: make-lzip-input-port/compressed
location: /tmp/guix-build-guile-lzlib-0.0.2.drv-0/guile-lzlib/tests/lzlib.scm:122
source:
+ (test-assert
+   "make-lzip-input-port/compressed"
+   (let* ((len (pk 'len (+ 10 (random 4000 %seed))))
+          (data (random-bytevector len))
+          (compressed
+            (make-lzip-input-port/compressed
+              (open-bytevector-input-port data)))
+          (result
+            (call-with-lzip-input-port
+              compressed
+              get-bytevector-all)))
+     (pk (bytevector-length result)
+         (bytevector-length data))
+     (bytevector=? result data)))

;;; (len 399)
actual-value: #f
actual-error:
+ (wrong-type-arg
+   #f
+   "Wrong type to apply: ~S"
+   (#f)
+   (#f))
result: FAIL

random seed for tests: 1612127558


command "make" "check" "-j" "4" "GUILE_AUTO_COMPILE=0" failed with status 2
builder for `/gnu/store/1v3a974h6rfgyqlwjilygi8jzl2hfxd8-guile-lzlib-0.0.2.drv' failed with exit code 1
@ build-failed /gnu/store/1v3a974h6rfgyqlwjilygi8jzl2hfxd8-guile-lzlib-0.0.2.drv - 1 builder for `/gnu/store/1v3a974h6rfgyqlwjilygi8jzl2hfxd8-guile-lzlib-0.0.2.drv' failed with exit code 1
cannot build derivation `/gnu/store/l1g66wxfjgvnji3zz5ggzvf421craivs-guix-daemon-1.2.0-11.d4a562b.drv': 1 dependencies couldn't be built
Backtrace:
          11 (primitive-load "/gnu/store/b7s395nfis8p79ii6w265iwbpb6z9610-compute-guix-derivation")
In ice-9/eval.scm:
    155:9 10 (_ _)
    159:9  9 (_ #(#(#(#(#(#(#(#(#(#(#(#(#(#<directory (guile-user) 3dfb97d0> (?)) #) ?) ?) #) ?) #) ?) #) #) #) #) #))
In ./guix/store.scm:
  2062:24  8 (run-with-store #<store-connection 256.99 3c62ec58> _ #:guile-for-build _ #:system _ #:target _)
   1896:8  7 (_ _)
In ./guix/gexp.scm:
   258:18  6 (_ _)
   1123:2  5 (_ _)
    982:2  4 (_ _)
    843:4  3 (_ _)
In ./guix/store.scm:
  1944:12  2 (_ #<store-connection 256.99 3c62ec58>)
   1362:5  1 (map/accumulate-builds #<store-connection 256.99 3c62ec58> _ _)
  1373:15  0 (_ #<store-connection 256.99 3c62ec58> _ _)

./guix/store.scm:1373:15: ERROR:
  1. &store-protocol-error:
      message: "build of `/gnu/store/l1g66wxfjgvnji3zz5ggzvf421craivs-guix-daemon-1.2.0-11.d4a562b.drv' failed"
      status: 100
error: while computing manifest entry derivation for armhf-linux
error %exception: (#<&message message: "You found a bug: the program '/gnu/store/b7s395nfis8p79ii6w265iwbpb6z9610-compute-guix-derivation'\nfailed to compute the derivation for Guix (version: \"4ea5767d3a2a8037ab3c76eda0cf0b1f4b597d69\"; system: \"armhf-linux\";\nhost version: \"1.2.0-8.7624ebb\"; pull-version: 1).\nPlease report it by email to <bug-guix@gnu.org>.\n">)
guix-data-service: computing the derivation-file-name for aarch64-linux
Computing Guix derivation for 'aarch64-linux'...  warning: SQLite database is busy

guix-data-service: computing the derivation-file-name for mips64el-linux
substitute: 
substitute: updating substitutes from 'https://ci.guix.gnu.org'...   0.0%
substitute: updating substitutes from 'https://ci.guix.gnu.org'... 100.0%
substitute: 
substitute: updating substitutes from 'https://ci.guix.gnu.org'...   0.0%
substitute: updating substitutes from 'https://ci.guix.gnu.org'... 100.0%
substitute: 
substitute: updating substitutes from 'https://ci.guix.gnu.org'...   0.0%
substitute: updating substitutes from 'https://ci.guix.gnu.org'... 100.0%
substitute: 
substitute: updating substitutes from 'https://ci.guix.gnu.org'...   0.0%
substitute: updating substitutes from 'https://ci.guix.gnu.org'... 100.0%
substitute: 
substitute: updating substitutes from 'https://ci.guix.gnu.org'...   0.0%
substitute: updating substitutes from 'https://ci.guix.gnu.org'... 100.0%
substitute: 
substitute: updating substitutes from 'https://ci.guix.gnu.org'...   0.0%
substitute: updating substitutes from 'https://ci.guix.gnu.org'... 100.0%
substitute: 
substitute: updating substitutes from 'https://ci.guix.gnu.org'...   0.0%
substitute: updating substitutes from 'https://ci.guix.gnu.org'... 100.0%
substitute: 
substitute: updating substitutes from 'https://ci.guix.gnu.org'...   0.0%
substitute: updating substitutes from 'https://ci.guix.gnu.org'... 100.0%
substitute: 
substitute: updating substitutes from 'https://ci.guix.gnu.org'...   0.0%
substitute: updating substitutes from 'https://ci.guix.gnu.org'... 100.0%
substitute: 
substitute: updating substitutes from 'https://ci.guix.gnu.org'...   0.0%
substitute: updating substitutes from 'https://ci.guix.gnu.org'... 100.0%
substitute: 
substitute: updating substitutes from 'https://ci.guix.gnu.org'...   0.0%
substitute: updating substitutes from 'https://ci.guix.gnu.org'... 100.0%
substitute: 
substitute: updating substitutes from 'https://ci.guix.gnu.org'...   0.0%
substitute: updating substitutes from 'https://ci.guix.gnu.org'... 100.0%
substitute: 
substitute: updating substitutes from 'https://ci.guix.gnu.org'...   0.0%
substitute: updating substitutes from 'https://ci.guix.gnu.org'... 100.0%
substitute: 
substitute: updating substitutes from 'https://ci.guix.gnu.org'...   0.0%
substitute: updating substitutes from 'https://ci.guix.gnu.org'... 100.0%
substitute: 
substitute: updating substitutes from 'https://ci.guix.gnu.org'...   0.0%
substitute: updating substitutes from 'https://ci.guix.gnu.org'... 100.0%
substitute: 
substitute: updating substitutes from 'https://ci.guix.gnu.org'...   0.0%
substitute: updating substitutes from 'https://ci.guix.gnu.org'... 100.0%
substitute: 
substitute: updating substitutes from 'https://ci.guix.gnu.org'...   0.0%
substitute: updating substitutes from 'https://ci.guix.gnu.org'... 100.0%
substitute: 
substitute: updating substitutes from 'https://ci.guix.gnu.org'...   0.0%
substitute: updating substitutes from 'https://ci.guix.gnu.org'... 100.0%
substitute: 
substitute: updating substitutes from 'https://ci.guix.gnu.org'...   0.0%
substitute: updating substitutes from 'https://ci.guix.gnu.org'... 100.0%
substitute: 
substitute: updating substitutes from 'https://ci.guix.gnu.org'...   0.0%
substitute: updating substitutes from 'https://ci.guix.gnu.org'... 100.0%
substitute: 
substitute: updating substitutes from 'https://ci.guix.gnu.org'...   0.0%
substitute: updating substitutes from 'https://ci.guix.gnu.org'... 100.0%
substitute: 
substitute: updating substitutes from 'https://ci.guix.gnu.org'...   0.0%
substitute: updating substitutes from 'https://ci.guix.gnu.org'... 100.0%
substitute: 
substitute: updating substitutes from 'https://ci.guix.gnu.org'...   0.0%
substitute: updating substitutes from 'https://ci.guix.gnu.org'... 100.0%
substitute: 
substitute: updating substitutes from 'https://ci.guix.gnu.org'...   0.0%
substitute: updating substitutes from 'https://ci.guix.gnu.org'... 100.0%
substitute: 
substitute: updating substitutes from 'https://ci.guix.gnu.org'...   0.0%
substitute: updating substitutes from 'https://ci.guix.gnu.org'... 100.0%
substitute: 
substitute: updating substitutes from 'https://ci.guix.gnu.org'...   0.0%
substitute: updating substitutes from 'https://ci.guix.gnu.org'... 100.0%
substitute: 
substitute: updating substitutes from 'https://ci.guix.gnu.org'...   0.0%
substitute: updating substitutes from 'https://ci.guix.gnu.org'... 100.0%
substitute: 
substitute: updating substitutes from 'https://ci.guix.gnu.org'...   0.0%
substitute: updating substitutes from 'https://ci.guix.gnu.org'... 100.0%
substitute: 
substitute: updating substitutes from 'https://ci.guix.gnu.org'...   0.0%
substitute: updating substitutes from 'https://ci.guix.gnu.org'... 100.0%
substitute: 
substitute: updating substitutes from 'https://ci.guix.gnu.org'...   0.0%
substitute: updating substitutes from 'https://ci.guix.gnu.org'... 100.0%
substitute: 
substitute: updating substitutes from 'https://ci.guix.gnu.org'...   0.0%
substitute: updating substitutes from 'https://ci.guix.gnu.org'... 100.0%
substitute: 
substitute: updating substitutes from 'https://ci.guix.gnu.org'...   0.0%
substitute: updating substitutes from 'https://ci.guix.gnu.org'... 100.0%
substitute: 
substitute: updating substitutes from 'https://ci.guix.gnu.org'...   0.0%
substitute: updating substitutes from 'https://ci.guix.gnu.org'... 100.0%
substitute: 
substitute: updating substitutes from 'https://ci.guix.gnu.org'...   0.0%
substitute: updating substitutes from 'https://ci.guix.gnu.org'... 100.0%
substitute: 
substitute: updating substitutes from 'https://ci.guix.gnu.org'...   0.0%
substitute: updating substitutes from 'https://ci.guix.gnu.org'... 100.0%
substitute: 
substitute: updating substitutes from 'https://ci.guix.gnu.org'...   0.0%
substitute: updating substitutes from 'https://ci.guix.gnu.org'... 100.0%
substitute: 
substitute: updating substitutes from 'https://ci.guix.gnu.org'...   0.0%
substitute: updating substitutes from 'https://ci.guix.gnu.org'... 100.0%
substitute: 
substitute: updating substitutes from 'https://ci.guix.gnu.org'...   0.0%
substitute: updating substitutes from 'https://ci.guix.gnu.org'... 100.0%
substitute: 
substitute: updating substitutes from 'https://ci.guix.gnu.org'...   0.0%
substitute: updating substitutes from 'https://ci.guix.gnu.org'... 100.0%
substitute: 
substitute: updating substitutes from 'https://ci.guix.gnu.org'...   0.0%
substitute: updating substitutes from 'https://ci.guix.gnu.org'... 100.0%
substitute: 
substitute: updating substitutes from 'https://ci.guix.gnu.org'...   0.0%
substitute: updating substitutes from 'https://ci.guix.gnu.org'... 100.0%
substitute: 
substitute: updating substitutes from 'https://ci.guix.gnu.org'...   0.0%
substitute: updating substitutes from 'https://ci.guix.gnu.org'... 100.0%
substitute: 
substitute: updating substitutes from 'https://ci.guix.gnu.org'...   0.0%
substitute: updating substitutes from 'https://ci.guix.gnu.org'... 100.0%
substitute: 
substitute: updating substitutes from 'https://ci.guix.gnu.org'...   0.0%
substitute: updating substitutes from 'https://ci.guix.gnu.org'... 100.0%
substitute: 
substitute: updating substitutes from 'https://ci.guix.gnu.org'...   0.0%
substitute: updating substitutes from 'https://ci.guix.gnu.org'... 100.0%
substitute: 
substitute: updating substitutes from 'https://ci.guix.gnu.org'...   0.0%
substitute: updating substitutes from 'https://ci.guix.gnu.org'... 100.0%
substitute: 
substitute: updating substitutes from 'https://ci.guix.gnu.org'...   0.0%
substitute: updating substitutes from 'https://ci.guix.gnu.org'... 100.0%
substitute: 
substitute: updating substitutes from 'https://ci.guix.gnu.org'...   0.0%
substitute: updating substitutes from 'https://ci.guix.gnu.org'... 100.0%
substitute: 
substitute: updating substitutes from 'https://ci.guix.gnu.org'...   0.0%
substitute: updating substitutes from 'https://ci.guix.gnu.org'... 100.0%
substitute: 
substitute: updating substitutes from 'https://ci.guix.gnu.org'...   0.0%
substitute: updating substitutes from 'https://ci.guix.gnu.org'... 100.0%
substitute: 
substitute: updating substitutes from 'https://ci.guix.gnu.org'...   0.0%
substitute: updating substitutes from 'https://ci.guix.gnu.org'... 100.0%
substitute: 
substitute: updating substitutes from 'https://ci.guix.gnu.org'...   0.0%
substitute: updating substitutes from 'https://ci.guix.gnu.org'... 100.0%
substitute: 
substitute: updating substitutes from 'https://ci.guix.gnu.org'...   0.0%
substitute: updating substitutes from 'https://ci.guix.gnu.org'... 100.0%
substitute: 
substitute: updating substitutes from 'https://ci.guix.gnu.org'...   0.0%
substitute: updating substitutes from 'https://ci.guix.gnu.org'... 100.0%
substitute: 
substitute: updating substitutes from 'https://ci.guix.gnu.org'...   0.0%
substitute: updating substitutes from 'https://ci.guix.gnu.org'... 100.0%
substitute: 
substitute: updating substitutes from 'https://ci.guix.gnu.org'...   0.0%
substitute: updating substitutes from 'https://ci.guix.gnu.org'... 100.0%
substitute: 
substitute: updating substitutes from 'https://ci.guix.gnu.org'...   0.0%
substitute: updating substitutes from 'https://ci.guix.gnu.org'... 100.0%
substitute: 
substitute: updating substitutes from 'https://ci.guix.gnu.org'...   0.0%
substitute: updating substitutes from 'https://ci.guix.gnu.org'... 100.0%
substitute: 
substitute: updating substitutes from 'https://ci.guix.gnu.org'...   0.0%
substitute: updating substitutes from 'https://ci.guix.gnu.org'... 100.0%
substitute: 
substitute: updating substitutes from 'https://ci.guix.gnu.org'...   0.0%
substitute: updating substitutes from 'https://ci.guix.gnu.org'... 100.0%
substitute: 
substitute: updating substitutes from 'https://ci.guix.gnu.org'...   0.0%
substitute: updating substitutes from 'https://ci.guix.gnu.org'... 100.0%
substitute: 
substitute: updating substitutes from 'https://ci.guix.gnu.org'...   0.0%
substitute: updating substitutes from 'https://ci.guix.gnu.org'... 100.0%
substitute: 
substitute: updating substitutes from 'https://ci.guix.gnu.org'...   0.0%
substitute: updating substitutes from 'https://ci.guix.gnu.org'... 100.0%
substitute: 
substitute: updating substitutes from 'https://ci.guix.gnu.org'...   0.0%
substitute: updating substitutes from 'https://ci.guix.gnu.org'... 100.0%
substitute: 
substitute: updating substitutes from 'https://ci.guix.gnu.org'...   0.0%
substitute: updating substitutes from 'https://ci.guix.gnu.org'... 100.0%
substitute: 
substitute: updating substitutes from 'https://ci.guix.gnu.org'...   0.0%
substitute: updating substitutes from 'https://ci.guix.gnu.org'... 100.0%
substitute: 
substitute: updating substitutes from 'https://ci.guix.gnu.org'...   0.0%
substitute: updating substitutes from 'https://ci.guix.gnu.org'... 100.0%
substitute: 
substitute: updating substitutes from 'https://ci.guix.gnu.org'...   0.0%
substitute: updating substitutes from 'https://ci.guix.gnu.org'... 100.0%
substitute: 
substitute: updating substitutes from 'https://ci.guix.gnu.org'...   0.0%
substitute: updating substitutes from 'https://ci.guix.gnu.org'... 100.0%
substitute: 
substitute: updating substitutes from 'https://ci.guix.gnu.org'...   0.0%
substitute: updating substitutes from 'https://ci.guix.gnu.org'... 100.0%
substitute: 
substitute: updating substitutes from 'https://ci.guix.gnu.org'...   0.0%
substitute: updating substitutes from 'https://ci.guix.gnu.org'... 100.0%
substitute: 
substitute: updating substitutes from 'https://ci.guix.gnu.org'...   0.0%
substitute: updating substitutes from 'https://ci.guix.gnu.org'... 100.0%
substitute: 
substitute: updating substitutes from 'https://ci.guix.gnu.org'...   0.0%
substitute: updating substitutes from 'https://ci.guix.gnu.org'... 100.0%
substitute: 
substitute: updating substitutes from 'https://ci.guix.gnu.org'...   0.0%
substitute: updating substitutes from 'https://ci.guix.gnu.org'... 100.0%
substitute: 
substitute: updating substitutes from 'https://ci.guix.gnu.org'...   0.0%
substitute: updating substitutes from 'https://ci.guix.gnu.org'... 100.0%
substitute: 
substitute: updating substitutes from 'https://ci.guix.gnu.org'...   0.0%
substitute: updating substitutes from 'https://ci.guix.gnu.org'... 100.0%
substitute: 
substitute: updating substitutes from 'https://ci.guix.gnu.org'...   0.0%
substitute: updating substitutes from 'https://ci.guix.gnu.org'... 100.0%
substitute: 
substitute: updating substitutes from 'https://ci.guix.gnu.org'...   0.0%
substitute: updating substitutes from 'https://ci.guix.gnu.org'... 100.0%
substitute: 
substitute: updating substitutes from 'https://ci.guix.gnu.org'...   0.0%
substitute: updating substitutes from 'https://ci.guix.gnu.org'... 100.0%
substitute: 
substitute: updating substitutes from 'https://ci.guix.gnu.org'...   0.0%
substitute: updating substitutes from 'https://ci.guix.gnu.org'... 100.0%
substitute: 
substitute: updating substitutes from 'https://ci.guix.gnu.org'...   0.0%
substitute: updating substitutes from 'https://ci.guix.gnu.org'... 100.0%
substitute: 
substitute: updating substitutes from 'https://ci.guix.gnu.org'...   0.0%
substitute: updating substitutes from 'https://ci.guix.gnu.org'... 100.0%
substitute: 
substitute: updating substitutes from 'https://ci.guix.gnu.org'...   0.0%
substitute: updating substitutes from 'https://ci.guix.gnu.org'... 100.0%
substitute: 
substitute: updating substitutes from 'https://ci.guix.gnu.org'...   0.0%
substitute: updating substitutes from 'https://ci.guix.gnu.org'... 100.0%
substitute: 
substitute: updating substitutes from 'https://ci.guix.gnu.org'...   0.0%
substitute: updating substitutes from 'https://ci.guix.gnu.org'... 100.0%
substitute: 
substitute: updating substitutes from 'https://ci.guix.gnu.org'...   0.0%
substitute: updating substitutes from 'https://ci.guix.gnu.org'... 100.0%
substitute: 
substitute: updating substitutes from 'https://ci.guix.gnu.org'...   0.0%
substitute: updating substitutes from 'https://ci.guix.gnu.org'... 100.0%
substitute: 
substitute: updating substitutes from 'https://ci.guix.gnu.org'...   0.0%
substitute: updating substitutes from 'https://ci.guix.gnu.org'... 100.0%
substitute: 
substitute: updating substitutes from 'https://ci.guix.gnu.org'...   0.0%
substitute: updating substitutes from 'https://ci.guix.gnu.org'... 100.0%
substitute: 
substitute: updating substitutes from 'https://ci.guix.gnu.org'...   0.0%
substitute: updating substitutes from 'https://ci.guix.gnu.org'... 100.0%
substitute: 
substitute: updating substitutes from 'https://ci.guix.gnu.org'...   0.0%
substitute: updating substitutes from 'https://ci.guix.gnu.org'... 100.0%
substitute: 
substitute: updating substitutes from 'https://ci.guix.gnu.org'...   0.0%
substitute: updating substitutes from 'https://ci.guix.gnu.org'... 100.0%
substitute: 
substitute: updating substitutes from 'https://ci.guix.gnu.org'...   0.0%
substitute: updating substitutes from 'https://ci.guix.gnu.org'... 100.0%
substitute: 
substitute: updating substitutes from 'https://ci.guix.gnu.org'...   0.0%
substitute: updating substitutes from 'https://ci.guix.gnu.org'... 100.0%
substitute: 
substitute: updating substitutes from 'https://ci.guix.gnu.org'...   0.0%
substitute: updating substitutes from 'https://ci.guix.gnu.org'... 100.0%
substitute: 
substitute: updating substitutes from 'https://ci.guix.gnu.org'...   0.0%
substitute: updating substitutes from 'https://ci.guix.gnu.org'... 100.0%
substitute: 
substitute: updating substitutes from 'https://ci.guix.gnu.org'...   0.0%
substitute: updating substitutes from 'https://ci.guix.gnu.org'... 100.0%
substitute: 
substitute: updating substitutes from 'https://ci.guix.gnu.org'...   0.0%
substitute: updating substitutes from 'https://ci.guix.gnu.org'... 100.0%
substitute: 
substitute: updating substitutes from 'https://ci.guix.gnu.org'...   0.0%
substitute: updating substitutes from 'https://ci.guix.gnu.org'... 100.0%
substitute: 
substitute: updating substitutes from 'https://ci.guix.gnu.org'...   0.0%
substitute: updating substitutes from 'https://ci.guix.gnu.org'... 100.0%
substitute: 
substitute: updating substitutes from 'https://ci.guix.gnu.org'...   0.0%
substitute: updating substitutes from 'https://ci.guix.gnu.org'... 100.0%
substitute: 
substitute: updating substitutes from 'https://ci.guix.gnu.org'...   0.0%
substitute: updating substitutes from 'https://ci.guix.gnu.org'... 100.0%
@ build-started /gnu/store/yx69vp44jkhn06vfnavvzsp0ywvamj3c-guile-bootstrap-2.0.drv - mips64el-linux /var/log/guix/drvs/yx//69vp44jkhn06vfnavvzsp0ywvamj3c-guile-bootstrap-2.0.drv.bz2 2585
substitute: 
substitute: updating substitutes from 'https://ci.guix.gnu.org'...   0.0%
substitute: updating substitutes from 'https://ci.guix.gnu.org'... 100.0%
substitute: 
substitute: updating substitutes from 'https://ci.guix.gnu.org'...   0.0%
substitute: updating substitutes from 'https://ci.guix.gnu.org'... 100.0%
substitute: 
substitute: updating substitutes from 'https://ci.guix.gnu.org'...   0.0%
substitute: updating substitutes from 'https://ci.guix.gnu.org'... 100.0%
substitute: 
substitute: updating substitutes from 'https://ci.guix.gnu.org'...   0.0%
substitute: updating substitutes from 'https://ci.guix.gnu.org'... 100.0%
substitute: 
substitute: updating substitutes from 'https://ci.guix.gnu.org'...   0.0%
substitute: updating substitutes from 'https://ci.guix.gnu.org'... 100.0%
substitute: 
substitute: updating substitutes from 'https://ci.guix.gnu.org'...   0.0%
substitute: updating substitutes from 'https://ci.guix.gnu.org'... 100.0%
substitute: 
substitute: updating substitutes from 'https://ci.guix.gnu.org'...   0.0%
substitute: updating substitutes from 'https://ci.guix.gnu.org'... 100.0%
substitute: 
substitute: updating substitutes from 'https://ci.guix.gnu.org'...   0.0%
substitute: updating substitutes from 'https://ci.guix.gnu.org'... 100.0%
substitute: 
substitute: updating substitutes from 'https://ci.guix.gnu.org'...   0.0%
substitute: updating substitutes from 'https://ci.guix.gnu.org'... 100.0%
substitute: 
substitute: updating substitutes from 'https://ci.guix.gnu.org'...   0.0%
substitute: updating substitutes from 'https://ci.guix.gnu.org'... 100.0%
substitute: 
substitute: updating substitutes from 'https://ci.guix.gnu.org'...   0.0%
substitute: updating substitutes from 'https://ci.guix.gnu.org'... 100.0%
substitute: 
substitute: updating substitutes from 'https://ci.guix.gnu.org'...   0.0%
substitute: updating substitutes from 'https://ci.guix.gnu.org'... 100.0%
substitute: 
substitute: updating substitutes from 'https://ci.guix.gnu.org'...   0.0%
substitute: updating substitutes from 'https://ci.guix.gnu.org'... 100.0%
substitute: 
substitute: updating substitutes from 'https://ci.guix.gnu.org'...   0.0%
substitute: updating substitutes from 'https://ci.guix.gnu.org'... 100.0%
substitute: 
substitute: updating substitutes from 'https://ci.guix.gnu.org'...   0.0%
substitute: updating substitutes from 'https://ci.guix.gnu.org'... 100.0%
substitute: 
substitute: updating substitutes from 'https://ci.guix.gnu.org'...   0.0%
substitute: updating substitutes from 'https://ci.guix.gnu.org'... 100.0%
substitute: 
substitute: updating substitutes from 'https://ci.guix.gnu.org'...   0.0%
substitute: updating substitutes from 'https://ci.guix.gnu.org'... 100.0%
substitute: 
substitute: updating substitutes from 'https://ci.guix.gnu.org'...   0.0%
substitute: updating substitutes from 'https://ci.guix.gnu.org'... 100.0%
substitute: 
substitute: updating substitutes from 'https://ci.guix.gnu.org'...   0.0%
substitute: updating substitutes from 'https://ci.guix.gnu.org'... 100.0%
substitute: 
substitute: updating substitutes from 'https://ci.guix.gnu.org'...   0.0%
substitute: updating substitutes from 'https://ci.guix.gnu.org'... 100.0%
substitute: 
substitute: updating substitutes from 'https://ci.guix.gnu.org'...   0.0%
substitute: updating substitutes from 'https://ci.guix.gnu.org'... 100.0%
@ unsupported-platform /gnu/store/yx69vp44jkhn06vfnavvzsp0ywvamj3c-guile-bootstrap-2.0.drv mips64el-linux
while setting up the build environment: a `mips64el-linux' is required to build `/gnu/store/yx69vp44jkhn06vfnavvzsp0ywvamj3c-guile-bootstrap-2.0.drv', but I am a `x86_64-linux'
builder for `/gnu/store/yx69vp44jkhn06vfnavvzsp0ywvamj3c-guile-bootstrap-2.0.drv' failed with exit code 1
@ build-failed /gnu/store/yx69vp44jkhn06vfnavvzsp0ywvamj3c-guile-bootstrap-2.0.drv - 1 builder for `/gnu/store/yx69vp44jkhn06vfnavvzsp0ywvamj3c-guile-bootstrap-2.0.drv' failed with exit code 1
cannot build derivation `/gnu/store/dxq4pywr7lgh3dd43ib22hfpj34friya-bash-minimal-5.0.16.drv': 1 dependencies couldn't be built
cannot build derivation `/gnu/store/f5vscmzihgcv875jvhd71fcb83swf23s-binutils-2.34.drv': 1 dependencies couldn't be built
cannot build derivation `/gnu/store/95332a4b4yq67gmsjzkw2q6gfrxynmfp-binutils-cross-boot0-2.34.drv': 1 dependencies couldn't be built
cannot build derivation `/gnu/store/y2iixw7jxvz34y7sh3lmsf5sw9hbqm3h-bootstrap-binaries-0.drv': 1 dependencies couldn't be built
cannot build derivation `/gnu/store/3yj0v338l51r5n5x8zssdpk7wi6pr5ai-coreutils-8.32.tar.xz.drv': 1 dependencies couldn't be built
cannot build derivation `/gnu/store/5msm6qmizvx19di70svaqdjvdjri57mn-diffutils-boot0-3.7.drv': 1 dependencies couldn't be built
cannot build derivation `/gnu/store/0ylf94w2pzlrlsqfawizlzr88p83x792-file-boot0-5.38.drv': 1 dependencies couldn't be built
cannot build derivation `/gnu/store/8mvxijpp08vw2kmk0167i57niihc8vhc-findutils-4.7.0.tar.xz.drv': 1 dependencies couldn't be built
cannot build derivation `/gnu/store/y0z9bp3x79n0rjgwi8h46arr883154ap-findutils-boot0-4.7.0.drv': 1 dependencies couldn't be built
cannot build derivation `/gnu/store/x6c5d3la5jcxp9bqnsdjridczhkys4ps-gcc-7.5.0.drv': 1 dependencies couldn't be built
cannot build derivation `/gnu/store/ma97vwnwmapvrq8lvgcxycxqgc8cbph1-glibc-2.31.drv': 1 dependencies couldn't be built
cannot build derivation `/gnu/store/r738zyln6sj9kcdhsqw0s0ri464qza7n-gmp-6.2.0.drv': 1 dependencies couldn't be built
cannot build derivation `/gnu/store/qc3yd860wk6vcmdp2b5rwx6x8fck9l49-grep-3.4.tar.xz.drv': 1 dependencies couldn't be built
cannot build derivation `/gnu/store/syzg38yfdy2543rlcwssrphyljax0jnj-guile-3.0.2.drv': 1 dependencies couldn't be built
cannot build derivation `/gnu/store/20d888jc67j0gkbnf55kamybxig8fqvv-gzip-1.10.drv': 1 dependencies couldn't be built
cannot build derivation `/gnu/store/66d3vhqvjbnam0wh8xhh054kr7n8gm83-ld-wrapper-boot0-0.drv': 1 dependencies couldn't be built
cannot build derivation `/gnu/store/mvi7yz80zh67xiv50yjnx339pkbr7vy3-ld-wrapper-boot3-0.drv': 1 dependencies couldn't be built
cannot build derivation `/gnu/store/fffr7rm5akqp9kg1vsjaihd15nb0pndm-libgc-8.0.4.drv': 1 dependencies couldn't be built
cannot build derivation `/gnu/store/7ibi9p3bgjf5n6hi3d3bplaycdjhz060-libltdl-2.4.6.drv': 1 dependencies couldn't be built
cannot build derivation `/gnu/store/8k5nnlq47jb3ap8w1iq3lbhr85592fn9-libunistring-0.9.10.drv': 1 dependencies couldn't be built
cannot build derivation `/gnu/store/pb4igk4iw823mlhsvwr4ncxjjys3lq68-linux-libre-headers-5.4.20.drv': 1 dependencies couldn't be built
cannot build derivation `/gnu/store/ghsd7fis4wqkwy5vh329p78wcfkvcd8n-make-4.3.tar.xz.drv': 1 dependencies couldn't be built
cannot build derivation `/gnu/store/8wcyf5fhisiblai7bklbir29raz2xns7-make-boot0-4.3.drv': 1 dependencies couldn't be built
cannot build derivation `/gnu/store/45b8y8822rd09lh438pcqhg44971l4x6-patch-2.7.6.tar.xz.drv': 1 dependencies couldn't be built
cannot build derivation `/gnu/store/7kymdyccqavdi93ih2nn2hm4r7zxqwa5-perl-5.30.2.tar.xz.drv': 1 dependencies couldn't be built
cannot build derivation `/gnu/store/j2dwzi5jzdzs35mnsskxl69wlw2m1ilv-perl-boot0-5.30.2.drv': 1 dependencies couldn't be built
cannot build derivation `/gnu/store/sc45aw49fpaqzzy39bak22c2vp3m33cx-tar-1.32.tar.xz.drv': 1 dependencies couldn't be built
cannot build derivation `/gnu/store/xf323l5isv6v1fdlj689iwfr1jnkzpf2-compute-guix-derivation.drv': 1 dependencies couldn't be built
error: while computing manifest entry derivation for mips64el-linux
error %exception: (#<&store-protocol-error message: "build of `/gnu/store/xf323l5isv6v1fdlj689iwfr1jnkzpf2-compute-guix-derivation.drv' failed" status: 100>)
guix-data-service: computing the derivation-file-name for i586-gnu
substitute: 
substitute: updating substitutes from 'https://ci.guix.gnu.org'...   0.0%
substitute: updating substitutes from 'https://ci.guix.gnu.org'... 100.0%
substitute: 
substitute: updating substitutes from 'https://ci.guix.gnu.org'...   0.0%
substitute: updating substitutes from 'https://ci.guix.gnu.org'... 100.0%
@ build-started /gnu/store/zcaxvsp8klsqgv8gc2sfvy9i03xsg5rp-config.scm.drv - i586-gnu /var/log/guix/drvs/zc//axvsp8klsqgv8gc2sfvy9i03xsg5rp-config.scm.drv.bz2 2601
@ build-started /gnu/store/w2ycyh4jrmy4fx2m96371sms57l9kah8-git.scm.drv - i586-gnu /var/log/guix/drvs/w2//ycyh4jrmy4fx2m96371sms57l9kah8-git.scm.drv.bz2 2603
@ build-started /gnu/store/n91a4wbwkrmqyikglrk30zvby9izsm6i-hash.scm.drv - i586-gnu /var/log/guix/drvs/n9//1a4wbwkrmqyikglrk30zvby9izsm6i-hash.scm.drv.bz2 2605
@ unsupported-platform /gnu/store/zcaxvsp8klsqgv8gc2sfvy9i03xsg5rp-config.scm.drv i586-gnu
while setting up the build environment: a `i586-gnu' is required to build `/gnu/store/zcaxvsp8klsqgv8gc2sfvy9i03xsg5rp-config.scm.drv', but I am a `x86_64-linux'
@ unsupported-platform /gnu/store/w2ycyh4jrmy4fx2m96371sms57l9kah8-git.scm.drv i586-gnu
while setting up the build environment: a `i586-gnu' is required to build `/gnu/store/w2ycyh4jrmy4fx2m96371sms57l9kah8-git.scm.drv', but I am a `x86_64-linux'
@ unsupported-platform /gnu/store/n91a4wbwkrmqyikglrk30zvby9izsm6i-hash.scm.drv i586-gnu
while setting up the build environment: a `i586-gnu' is required to build `/gnu/store/n91a4wbwkrmqyikglrk30zvby9izsm6i-hash.scm.drv', but I am a `x86_64-linux'
builder for `/gnu/store/zcaxvsp8klsqgv8gc2sfvy9i03xsg5rp-config.scm.drv' failed with exit code 1
@ build-failed /gnu/store/zcaxvsp8klsqgv8gc2sfvy9i03xsg5rp-config.scm.drv - 1 builder for `/gnu/store/zcaxvsp8klsqgv8gc2sfvy9i03xsg5rp-config.scm.drv' failed with exit code 1
builder for `/gnu/store/w2ycyh4jrmy4fx2m96371sms57l9kah8-git.scm.drv' failed with exit code 1
@ build-failed /gnu/store/w2ycyh4jrmy4fx2m96371sms57l9kah8-git.scm.drv - 1 builder for `/gnu/store/w2ycyh4jrmy4fx2m96371sms57l9kah8-git.scm.drv' failed with exit code 1
cannot build derivation `/gnu/store/rdacxhdmcqkwk7z7l4r9l0n7h6pj6qpa-module-import.drv': 1 dependencies couldn't be built
cannot build derivation `/gnu/store/2yi04z29x34dlqv9ffwqwqa16p9ajr0z-compute-guix-derivation.drv': 1 dependencies couldn't be built
error: while computing manifest entry derivation for i586-gnu
error %exception: (#<&store-protocol-error message: "build of `/gnu/store/2yi04z29x34dlqv9ffwqwqa16p9ajr0z-compute-guix-derivation.drv' failed" status: 100>)
debug: Finished computing the channel derivation, took 1105 seconds
debug: x86_64-linux: channel dervation: ((manifest-entry-item . /gnu/store/44zw4kr9ngczdgj4akq4z9xvwq344f00-guix-4ea5767d3.drv) (profile . /gnu/store/aw0hvb7nmy1fdvap2bwjvsjkjni31d27-profile.drv))
debug: i686-linux: channel dervation: ((manifest-entry-item . /gnu/store/4wx6agj8fiic5d4fd6gf3n7wn8442a1a-guix-4ea5767d3.drv) (profile . /gnu/store/zz089r4b4nszg0ndplgmkw88kh481kmj-profile.drv))
debug: armhf-linux: channel dervation: ((manifest-entry-item . #f) (profile . #f))
debug: aarch64-linux: channel dervation: ((manifest-entry-item . /gnu/store/557x2l5fqnywb7rm7njjf0gl4h3jhmwk-guix-4ea5767d3.drv) (profile . /gnu/store/v94zfjkl8fdalyvx7kqgnplfhcvh8iv0-profile.drv))
debug: mips64el-linux: channel dervation: ((manifest-entry-item . #f) (profile . #f))
debug: i586-gnu: channel dervation: ((manifest-entry-item . #f) (profile . #f))
debug: Starting building the channel derivation
substitute: 
substitute: updating substitutes from 'https://ci.guix.gnu.org'...   0.0%
substitute: updating substitutes from 'https://ci.guix.gnu.org'... 100.0%
substitute: 
substitute: updating substitutes from 'https://ci.guix.gnu.org'...   0.0%
substitute: updating substitutes from 'https://ci.guix.gnu.org'... 100.0%
substitute: 
substitute: updating substitutes from 'https://ci.guix.gnu.org'...   0.0%
substitute: updating substitutes from 'https://ci.guix.gnu.org'... 100.0%
substitute: 
substitute: updating substitutes from 'https://ci.guix.gnu.org'...   0.0%
substitute: updating substitutes from 'https://ci.guix.gnu.org'... 100.0%
substitute: 
substitute: updating substitutes from 'https://ci.guix.gnu.org'...   0.0%
substitute: updating substitutes from 'https://ci.guix.gnu.org'... 100.0%
substitute: 
substitute: updating substitutes from 'https://ci.guix.gnu.org'...   0.0%
substitute: updating substitutes from 'https://ci.guix.gnu.org'... 100.0%
substitute: 
substitute: updating substitutes from 'https://ci.guix.gnu.org'...   0.0%
substitute: updating substitutes from 'https://ci.guix.gnu.org'... 100.0%
substitute: 
substitute: updating substitutes from 'https://ci.guix.gnu.org'...   0.0%
substitute: updating substitutes from 'https://ci.guix.gnu.org'... 100.0%
substitute: 
substitute: updating substitutes from 'https://ci.guix.gnu.org'...   0.0%
substitute: updating substitutes from 'https://ci.guix.gnu.org'... 100.0%
substitute: 
substitute: updating substitutes from 'https://ci.guix.gnu.org'...   0.0%
substitute: updating substitutes from 'https://ci.guix.gnu.org'... 100.0%
substitute: 
substitute: updating substitutes from 'https://ci.guix.gnu.org'...   0.0%
substitute: updating substitutes from 'https://ci.guix.gnu.org'... 100.0%
substitute: 
substitute: updating substitutes from 'https://ci.guix.gnu.org'...   0.0%
substitute: updating substitutes from 'https://ci.guix.gnu.org'... 100.0%
substitute: 
substitute: updating substitutes from 'https://ci.guix.gnu.org'...   0.0%
substitute: updating substitutes from 'https://ci.guix.gnu.org'... 100.0%
substitute: 
substitute: updating substitutes from 'https://ci.guix.gnu.org'...   0.0%
substitute: updating substitutes from 'https://ci.guix.gnu.org'... 100.0%
@ substituter-started /gnu/store/ad775b0xb7p5d72g2ifcfzw1q2fav84d-guix-packages-base substitute
@ substituter-started /gnu/store/kmb6ck313i1p6i8g2ldck20dc26za6qx-guix-system substitute
@ substituter-started /gnu/store/s9idg72awyd2s41q14i7gyy8a0bz58vb-guix-system-tests substitute
Downloading https://ci.guix.gnu.org/nar/lzip/ad775b0xb7p5d72g2ifcfzw1q2fav84d-guix-packages-base...
Downloading https://ci.guix.gnu.org/nar/lzip/kmb6ck313i1p6i8g2ldck20dc26za6qx-guix-system...
Downloading https://ci.guix.gnu.org/nar/lzip/s9idg72awyd2s41q14i7gyy8a0bz58vb-guix-system-tests...

 guix-system  5.3MiB                                                                                                                                                                                                     0B/s 00:00 [                  ]   0.0%
 guix-packages-base  9.1MiB                                                                                                                                                                                              0B/s 00:00 [                  ]   0.0%
 guix-system  5.3MiB                                                                                                                                                                                                 3.3MiB/s 00:00 [                  ]   1.2%
 guix-packages-base  9.1MiB                                                                                                                                                                                          3.3MiB/s 00:00 [                  ]   0.7%
 guix-system-tests  310KiB                                                                                                                                                                                               0B/s 00:00 [                  ]   0.0%
 guix-system-tests  310KiB                                                                                                                                                                                           1.6MiB/s 00:00 [###               ]  20.6%
 guix-packages-base  9.1MiB                                                                                                                                                                                          4.1MiB/s 00:00 [#                 ]  10.3%
 guix-system-tests  310KiB                                                                                                                                                                                           1.8MiB/s 00:00 [##################] 100.0%
 guix-system  5.3MiB                                                                                                                                                                                                 3.4MiB/s 00:00 [##                ]  15.3%

@ substituter-succeeded /gnu/store/s9idg72awyd2s41q14i7gyy8a0bz58vb-guix-system-tests
@ substituter-started /gnu/store/lfyx3c9q2c5n6yhwffiiz54glrsqcx08-guix-cli substitute

 guix-packages-base  9.1MiB                                                                                                                                                                                          4.4MiB/s 00:00 [###               ]  21.2%
 guix-system  5.3MiB                                                                                                                                                                                                 3.9MiB/s 00:00 [#####             ]  32.9%Downloading https://ci.guix.gnu.org/nar/lzip/lfyx3c9q2c5n6yhwffiiz54glrsqcx08-guix-cli...

 guix-packages-base  9.1MiB                                                                                                                                                                                          4.9MiB/s 00:01 [######            ]  34.2%
 guix-system  5.3MiB                                                                                                                                                                                                 4.2MiB/s 00:01 [#########         ]  50.5%
 guix-cli  715KiB                                                                                                                                                                                                        0B/s 00:00 [                  ]   0.0%
 guix-cli  715KiB                                                                                                                                                                                                    2.9MiB/s 00:00 [#                 ]   9.0%
 guix-packages-base  9.1MiB                                                                                                                                                                                          5.2MiB/s 00:01 [########          ]  47.8%
 guix-system  5.3MiB                                                                                                                                                                                                 4.6MiB/s 00:01 [#############     ]  74.0%
 guix-cli  715KiB                                                                                                                                                                                                    2.0MiB/s 00:00 [###########       ]  62.7%
 guix-cli  715KiB                                                                                                                                                                                                    2.4MiB/s 00:00 [##################] 100.0%

@ substituter-succeeded /gnu/store/lfyx3c9q2c5n6yhwffiiz54glrsqcx08-guix-cli
@ substituter-started /gnu/store/x7gbndi18wfjgdppmwwf92wr2y0rzvyb-guix-system-tests-modules substitute

 guix-packages-base  9.1MiB                                                                                                                                                                                          5.4MiB/s 00:01 [###########       ]  61.5%
 guix-system  5.3MiB                                                                                                                                                                                                 4.8MiB/s 00:01 [################# ]  95.1%
 guix-system  5.3MiB                                                                                                                                                                                                 4.7MiB/s 00:01 [##################] 100.0%

@ substituter-succeeded /gnu/store/kmb6ck313i1p6i8g2ldck20dc26za6qx-guix-system
@ substituter-started /gnu/store/6y5pcnq4gl2h7axgz9yfi2hsnkmk4plz-guix-cli-modules substitute

 guix-packages-base  9.1MiB                                                                                                                                                                                          5.3MiB/s 00:01 [#############     ]  73.1%
 guix-packages-base  9.1MiB                                                                                                                                                                                          5.4MiB/s 00:01 [###############   ]  87.5%Downloading https://ci.guix.gnu.org/nar/gzip/x7gbndi18wfjgdppmwwf92wr2y0rzvyb-guix-system-tests-modules...

 guix-system-tests-modules  273B                                                                                                                                                                                         0B/s 00:00 [                  ]   0.0%
 guix-system-tests-modules  273B                                                                                                                                                                                      62KiB/s 00:00 [##################] 100.0%
 guix-system-tests-modules  273B                                                                                                                                                                                      34KiB/s 00:00 [##################] 100.0%

@ substituter-succeeded /gnu/store/x7gbndi18wfjgdppmwwf92wr2y0rzvyb-guix-system-tests-modules
@ substituter-started /gnu/store/n8l7wrqp95rq0smd1r5a48xdlal2inav-guix-system-modules substitute

 guix-packages-base  9.1MiB                                                                                                                                                                                          5.4MiB/s 00:02 [##################] 100.0%
 guix-packages-base  9.1MiB                                                                                                                                                                                          5.4MiB/s 00:02 [##################] 100.0%

@ substituter-succeeded /gnu/store/ad775b0xb7p5d72g2ifcfzw1q2fav84d-guix-packages-base
@ substituter-started /gnu/store/yksrzy1y3piy7pkzlmz9z4pwigqb98sv-guix-packages-base-modules substitute
Downloading https://ci.guix.gnu.org/nar/gzip/6y5pcnq4gl2h7axgz9yfi2hsnkmk4plz-guix-cli-modules...

 guix-cli-modules  268B                                                                                                                                                                                                  0B/s 00:00 [                  ]   0.0%
 guix-cli-modules  268B                                                                                                                                                                                               94KiB/s 00:00 [##################] 100.0%
 guix-cli-modules  268B                                                                                                                                                                                               55KiB/s 00:00 [##################] 100.0%

Downloading https://ci.guix.gnu.org/nar/gzip/n8l7wrqp95rq0smd1r5a48xdlal2inav-guix-system-modules...

 guix-system-modules  269B                                                                                                                                                                                               0B/s 00:00 [                  ]   0.0%
 guix-system-modules  269B                                                                                                                                                                                            90KiB/s 00:00 [##################] 100.0%
 guix-system-modules  269B                                                                                                                                                                                            55KiB/s 00:00 [##################] 100.0%

@ substituter-succeeded /gnu/store/6y5pcnq4gl2h7axgz9yfi2hsnkmk4plz-guix-cli-modules
@ substituter-succeeded /gnu/store/n8l7wrqp95rq0smd1r5a48xdlal2inav-guix-system-modules
Downloading https://ci.guix.gnu.org/nar/gzip/yksrzy1y3piy7pkzlmz9z4pwigqb98sv-guix-packages-base-modules...

 guix-packages-base-modules  277B                                                                                                                                                                                        0B/s 00:00 [                  ]   0.0%
 guix-packages-base-modules  277B                                                                                                                                                                                     46KiB/s 00:00 [##################] 100.0%
 guix-packages-base-modules  277B                                                                                                                                                                                     24KiB/s 00:00 [##################] 100.0%

@ substituter-succeeded /gnu/store/yksrzy1y3piy7pkzlmz9z4pwigqb98sv-guix-packages-base-modules
@ substituter-started /gnu/store/d6h1zfrm8s6bb2hsypf3h3h17vb1r93r-guix-4ea5767d3-modules substitute
Downloading https://ci.guix.gnu.org/nar/lzip/d6h1zfrm8s6bb2hsypf3h3h17vb1r93r-guix-4ea5767d3-modules...

 guix-4ea5767d3-modules  19.7MiB                                                                                                                                                                                         0B/s 00:00 [                  ]   0.0%
 guix-4ea5767d3-modules  19.7MiB                                                                                                                                                                                     1.7MiB/s 00:00 [                  ]   0.3%
 guix-4ea5767d3-modules  19.7MiB                                                                                                                                                                                     4.9MiB/s 00:00 [#                 ]   6.0%
 guix-4ea5767d3-modules  19.7MiB                                                                                                                                                                                     5.3MiB/s 00:00 [##                ]  12.0%
 guix-4ea5767d3-modules  19.7MiB                                                                                                                                                                                     5.5MiB/s 00:01 [###               ]  18.4%
 guix-4ea5767d3-modules  19.7MiB                                                                                                                                                                                     5.6MiB/s 00:01 [####              ]  25.0%
 guix-4ea5767d3-modules  19.7MiB                                                                                                                                                                                     5.8MiB/s 00:01 [#####             ]  31.4%
 guix-4ea5767d3-modules  19.7MiB                                                                                                                                                                                     5.7MiB/s 00:01 [######            ]  37.4%
 guix-4ea5767d3-modules  19.7MiB                                                                                                                                                                                     5.7MiB/s 00:02 [#######           ]  43.4%
 guix-4ea5767d3-modules  19.7MiB                                                                                                                                                                                     5.6MiB/s 00:02 [########          ]  49.1%
 guix-4ea5767d3-modules  19.7MiB                                                                                                                                                                                     5.6MiB/s 00:02 [#########         ]  55.1%
 guix-4ea5767d3-modules  19.7MiB                                                                                                                                                                                     5.7MiB/s 00:02 [###########       ]  61.2%
 guix-4ea5767d3-modules  19.7MiB                                                                                                                                                                                     5.7MiB/s 00:02 [############      ]  67.2%
 guix-4ea5767d3-modules  19.7MiB                                                                                                                                                                                     5.6MiB/s 00:03 [#############     ]  72.9%
 guix-4ea5767d3-modules  19.7MiB                                                                                                                                                                                     5.6MiB/s 00:03 [##############    ]  78.9%
 guix-4ea5767d3-modules  19.7MiB                                                                                                                                                                                     5.7MiB/s 00:03 [###############   ]  85.2%
 guix-4ea5767d3-modules  19.7MiB                                                                                                                                                                                     5.7MiB/s 00:03 [################  ]  91.3%
 guix-4ea5767d3-modules  19.7MiB                                                                                                                                                                                     5.6MiB/s 00:03 [################# ]  96.3%
 guix-4ea5767d3-modules  19.7MiB                                                                                                                                                                                     5.6MiB/s 00:04 [##################] 100.0%

@ substituter-succeeded /gnu/store/d6h1zfrm8s6bb2hsypf3h3h17vb1r93r-guix-4ea5767d3-modules
@ substituter-started /gnu/store/jffvmxfdzkksqp27yihh716l6hlb5079-guix-module-union substitute
Downloading https://ci.guix.gnu.org/nar/lzip/jffvmxfdzkksqp27yihh716l6hlb5079-guix-module-union...

 guix-module-union  2KiB                                                                                                                                                                                                 0B/s 00:00 [                  ]   0.0%
 guix-module-union  2KiB                                                                                                                                                                                             362KiB/s 00:00 [##################] 100.0%
 guix-module-union  2KiB                                                                                                                                                                                              85KiB/s 00:00 [##################] 100.0%

@ substituter-succeeded /gnu/store/jffvmxfdzkksqp27yihh716l6hlb5079-guix-module-union
@ substituter-started /gnu/store/6nnbpk2bq2jhz5zh4f5d6yzfxlkcklc3-guix-command substitute
Downloading https://ci.guix.gnu.org/nar/gzip/6nnbpk2bq2jhz5zh4f5d6yzfxlkcklc3-guix-command...

 guix-command  633B                                                                                                                                                                                                      0B/s 00:00 [                  ]   0.0%
 guix-command  633B                                                                                                                                                                                                  161KiB/s 00:00 [##################] 100.0%
 guix-command  633B                                                                                                                                                                                                   87KiB/s 00:00 [##################] 100.0%

@ substituter-succeeded /gnu/store/6nnbpk2bq2jhz5zh4f5d6yzfxlkcklc3-guix-command
@ substituter-started /gnu/store/ymnfgwbzn8n47pq8fk6cai7irqx7pxia-guix-daemon substitute
Downloading https://ci.guix.gnu.org/nar/gzip/ymnfgwbzn8n47pq8fk6cai7irqx7pxia-guix-daemon...

 guix-daemon  394B                                                                                                                                                                                                       0B/s 00:00 [                  ]   0.0%
 guix-daemon  394B                                                                                                                                                                                                    45KiB/s 00:00 [##################] 100.0%
 guix-daemon  394B                                                                                                                                                                                                    24KiB/s 00:00 [##################] 100.0%

@ substituter-succeeded /gnu/store/ymnfgwbzn8n47pq8fk6cai7irqx7pxia-guix-daemon
@ substituter-started /gnu/store/hyxzvzwqg79rkkgip7q79fkbzsjrs0pf-guix-4ea5767d3 substitute
Downloading https://ci.guix.gnu.org/nar/lzip/hyxzvzwqg79rkkgip7q79fkbzsjrs0pf-guix-4ea5767d3...

 guix-4ea5767d3  12KiB                                                                                                                                                                                                   0B/s 00:00 [                  ]   0.0%
 guix-4ea5767d3  12KiB                                                                                                                                                                                               3.2MiB/s 00:00 [##################] 100.0%
 guix-4ea5767d3  12KiB                                                                                                                                                                                               928KiB/s 00:00 [##################] 100.0%

@ substituter-succeeded /gnu/store/hyxzvzwqg79rkkgip7q79fkbzsjrs0pf-guix-4ea5767d3
@ build-started /gnu/store/5mqhfqk47n7mvp35fwd12710fkciy7b9-ca-certificate-bundle.drv - x86_64-linux /var/log/guix/drvs/5m//qhfqk47n7mvp35fwd12710fkciy7b9-ca-certificate-bundle.drv.bz2 2711
@ build-started /gnu/store/pih9yghr5praqkbqv30fshgg0g347zhc-fonts-dir.drv - x86_64-linux /var/log/guix/drvs/pi//h9yghr5praqkbqv30fshgg0g347zhc-fonts-dir.drv.bz2 2713
@ build-started /gnu/store/6317srl17fz0zpz8b5az5yi3ijf3i0lf-info-dir.drv - x86_64-linux /var/log/guix/drvs/63//17srl17fz0zpz8b5az5yi3ijf3i0lf-info-dir.drv.bz2 2721
@ build-succeeded /gnu/store/pih9yghr5praqkbqv30fshgg0g347zhc-fonts-dir.drv -
@ build-started /gnu/store/wk23c42cn01hyns1ppp1vfnj6rh64qhy-manual-database.drv - x86_64-linux /var/log/guix/drvs/wk//23c42cn01hyns1ppp1vfnj6rh64qhy-manual-database.drv.bz2 2734
@ build-succeeded /gnu/store/5mqhfqk47n7mvp35fwd12710fkciy7b9-ca-certificate-bundle.drv -
@ build-started /gnu/store/0g53f7p13finmvvdhwh31jd192pjilkj-profile.drv - x86_64-linux /var/log/guix/drvs/0g//53f7p13finmvvdhwh31jd192pjilkj-profile.drv.bz2 2746
@ build-succeeded /gnu/store/6317srl17fz0zpz8b5az5yi3ijf3i0lf-info-dir.drv -
Creating manual page database...

[  1/  1] building list of man-db entries...
0 entries processed in 0.0 s
@ build-succeeded /gnu/store/0g53f7p13finmvvdhwh31jd192pjilkj-profile.drv -
@ build-started /gnu/store/w5r9d2v7dynqs8fmaqvidsxwaingv80h-inferior-script.scm.drv - x86_64-linux /var/log/guix/drvs/w5//r9d2v7dynqs8fmaqvidsxwaingv80h-inferior-script.scm.drv.bz2 2768
@ build-succeeded /gnu/store/wk23c42cn01hyns1ppp1vfnj6rh64qhy-manual-database.drv -
@ build-succeeded /gnu/store/w5r9d2v7dynqs8fmaqvidsxwaingv80h-inferior-script.scm.drv -
@ build-started /gnu/store/gglpgpqq5nbxmk49aq2zf98a30pm5wcn-guix-package-cache.drv - x86_64-linux /var/log/guix/drvs/gg//lpgpqq5nbxmk49aq2zf98a30pm5wcn-guix-package-cache.drv.bz2 2776
(repl-version 0 1 1)
Generating package cache for '/gnu/store/6z21j366k1qfkrz22gdaxr56kh8sr4l7-profile'...
(values (value "/gnu/store/rc923j3nfshimppwij9s9knlsdhk5yia-guix-package-cache/lib/guix/package.cache"))
@ build-succeeded /gnu/store/gglpgpqq5nbxmk49aq2zf98a30pm5wcn-guix-package-cache.drv -
@ build-started /gnu/store/aw0hvb7nmy1fdvap2bwjvsjkjni31d27-profile.drv - x86_64-linux /var/log/guix/drvs/aw//0hvb7nmy1fdvap2bwjvsjkjni31d27-profile.drv.bz2 2793
@ build-succeeded /gnu/store/aw0hvb7nmy1fdvap2bwjvsjkjni31d27-profile.drv -
debug: Finished building the channel derivation, took 29 seconds
debug: extract-information-from: /gnu/store/hyxzvzwqg79rkkgip7q79fkbzsjrs0pf-guix-4ea5767d3
debug: using open-inferior
guix repl: warning: 'nix-protocol-error?' is deprecated, use 'store-protocol-error?' instead
guix repl: warning: 'nix-protocol-error-message' is deprecated, use 'store-protocol-error-message' instead
debug: Starting building the glibc-locales derivation
debug: Finished building the glibc-locales derivation, took 0 seconds
debug: set GUIX_LOCPATH to /gnu/store/wff454axaqd5hd4xxhcagish4mj77dy7-glibc-locales-2.31/lib/locale:/gnu/store/9fgskzi20bfig3rxapgddsa26sspdsa1-glibc-utf8-locales-2.31/lib/locale
debug: using open-inferior
debug: Starting fetching inferior packages
debug: Finished fetching inferior packages, took 1 seconds
debug: Starting fetching inferior lint warnings
debug: Starting getting description lint warnings
guix repl: warning: 'nix-protocol-error?' is deprecated, use 'store-protocol-error?' instead
guix repl: warning: 'nix-protocol-error-message' is deprecated, use 'store-protocol-error-message' instead
debug: Finished getting description lint warnings, took 14 seconds
debug: Starting getting inputs-should-be-native lint warnings
guix repl: warning: 'nix-protocol-error?' is deprecated, use 'store-protocol-error?' instead
guix repl: warning: 'nix-protocol-error-message' is deprecated, use 'store-protocol-error-message' instead
debug: Finished getting inputs-should-be-native lint warnings, took 5 seconds
debug: Starting getting inputs-should-not-be-input lint warnings
guix repl: warning: 'nix-protocol-error?' is deprecated, use 'store-protocol-error?' instead
guix repl: warning: 'nix-protocol-error-message' is deprecated, use 'store-protocol-error-message' instead
debug: Finished getting inputs-should-not-be-input lint warnings, took 1 seconds
debug: Starting getting license lint warnings
guix repl: warning: 'nix-protocol-error?' is deprecated, use 'store-protocol-error?' instead
guix repl: warning: 'nix-protocol-error-message' is deprecated, use 'store-protocol-error-message' instead
debug: Finished getting license lint warnings, took 0 seconds
debug: Starting getting mirror-url lint warnings
guix repl: warning: 'nix-protocol-error?' is deprecated, use 'store-protocol-error?' instead
guix repl: warning: 'nix-protocol-error-message' is deprecated, use 'store-protocol-error-message' instead
debug: Finished getting mirror-url lint warnings, took 0 seconds
debug: Starting getting source-file-name lint warnings
guix repl: warning: 'nix-protocol-error?' is deprecated, use 'store-protocol-error?' instead
guix repl: warning: 'nix-protocol-error-message' is deprecated, use 'store-protocol-error-message' instead
debug: Finished getting source-file-name lint warnings, took 1 seconds
debug: Starting getting source-unstable-tarball lint warnings
guix repl: warning: 'nix-protocol-error?' is deprecated, use 'store-protocol-error?' instead
guix repl: warning: 'nix-protocol-error-message' is deprecated, use 'store-protocol-error-message' instead
debug: Finished getting source-unstable-tarball lint warnings, took 4 seconds
debug: Starting getting derivation lint warnings
guix repl: warning: 'nix-protocol-error?' is deprecated, use 'store-protocol-error?' instead
guix repl: warning: 'nix-protocol-error-message' is deprecated, use 'store-protocol-error-message' instead
debug: Finished getting derivation lint warnings, took 632 seconds
debug: Starting getting profile-collisions lint warnings
guix repl: warning: 'nix-protocol-error?' is deprecated, use 'store-protocol-error?' instead
guix repl: warning: 'nix-protocol-error-message' is deprecated, use 'store-protocol-error-message' instead
debug: Finished getting profile-collisions lint warnings, took 68 seconds
debug: Starting getting patch-file-names lint warnings
guix repl: warning: 'nix-protocol-error?' is deprecated, use 'store-protocol-error?' instead
guix repl: warning: 'nix-protocol-error-message' is deprecated, use 'store-protocol-error-message' instead
debug: Finished getting patch-file-names lint warnings, took 3 seconds
debug: Starting getting patch-headers lint warnings
guix repl: warning: 'nix-protocol-error?' is deprecated, use 'store-protocol-error?' instead
guix repl: warning: 'nix-protocol-error-message' is deprecated, use 'store-protocol-error-message' instead
debug: Finished getting patch-headers lint warnings, took 0 seconds
debug: Starting getting formatting lint warnings
guix repl: warning: 'nix-protocol-error?' is deprecated, use 'store-protocol-error?' instead
guix repl: warning: 'nix-protocol-error-message' is deprecated, use 'store-protocol-error-message' instead
debug: Finished getting formatting lint warnings, took 266 seconds
debug: Finished fetching inferior lint warnings, took 994 seconds
debug: Starting getting inferior derivations
heap size: 58.0 MiB
debug: Starting getting derivations for ((x86_64-linux . #f))
guix repl: warning: 'nix-protocol-error?' is deprecated, use 'store-protocol-error?' instead
guix repl: warning: 'nix-protocol-error-message' is deprecated, use 'store-protocol-error-message' instead
warning: request for x86_64-linux derivation for wine-staging produced a derivation for system i686-linux
warning: request for x86_64-linux derivation for wine-minimal produced a derivation for system i686-linux
warning: request for x86_64-linux derivation for wine produced a derivation for system i686-linux
warning: request for x86_64-linux derivation for mes-minimal produced a derivation for system i686-linux
warning: request for x86_64-linux derivation for memtest86+ produced a derivation for system i686-linux
warning: request for x86_64-linux derivation for gens-gs produced a derivation for system i686-linux
warning: request for x86_64-linux derivation for dev86 produced a derivation for system i686-linux
warning: request for x86_64-linux derivation for ada-ed produced a derivation for system i686-linux
debug: Finished getting derivations for ((x86_64-linux . #f)), took 3 seconds
heap size: 65.0 MiB
debug: Starting getting derivations for ((i686-linux . #f))
guix repl: warning: 'nix-protocol-error?' is deprecated, use 'store-protocol-error?' instead
guix repl: warning: 'nix-protocol-error-message' is deprecated, use 'store-protocol-error-message' instead
debug: Finished getting derivations for ((i686-linux . #f)), took 3 seconds
heap size: 66.0 MiB
debug: Starting getting derivations for ((armhf-linux . #f))
guix repl: warning: 'nix-protocol-error?' is deprecated, use 'store-protocol-error?' instead
guix repl: warning: 'nix-protocol-error-message' is deprecated, use 'store-protocol-error-message' instead
warning: request for armhf-linux derivation for mes-minimal produced a derivation for system i686-linux
warning: request for armhf-linux derivation for memtest86+ produced a derivation for system i686-linux
warning: request for armhf-linux derivation for gens-gs produced a derivation for system i686-linux
warning: request for armhf-linux derivation for dev86 produced a derivation for system i686-linux
debug: Finished getting derivations for ((armhf-linux . #f)), took 4 seconds
heap size: 77.0 MiB
debug: Starting getting derivations for ((aarch64-linux . #f))
guix repl: warning: 'nix-protocol-error?' is deprecated, use 'store-protocol-error?' instead
guix repl: warning: 'nix-protocol-error-message' is deprecated, use 'store-protocol-error-message' instead
warning: request for aarch64-linux derivation for wine-staging produced a derivation for system armhf-linux
warning: request for aarch64-linux derivation for wine-minimal produced a derivation for system armhf-linux
warning: request for aarch64-linux derivation for wine produced a derivation for system armhf-linux
warning: request for aarch64-linux derivation for mes-minimal produced a derivation for system i686-linux
warning: request for aarch64-linux derivation for memtest86+ produced a derivation for system i686-linux
warning: request for aarch64-linux derivation for go produced a derivation for system armhf-linux
warning: request for aarch64-linux derivation for gens-gs produced a derivation for system i686-linux
warning: request for aarch64-linux derivation for dev86 produced a derivation for system i686-linux
warning: request for aarch64-linux derivation for ada-ed produced a derivation for system armhf-linux
debug: Finished getting derivations for ((aarch64-linux . #f)), took 4 seconds
heap size: 86.0 MiB
debug: Starting getting derivations for ((mips64el-linux . #f))
guix repl: warning: 'nix-protocol-error?' is deprecated, use 'store-protocol-error?' instead
guix repl: warning: 'nix-protocol-error-message' is deprecated, use 'store-protocol-error-message' instead
warning: request for mips64el-linux derivation for wine-staging produced a derivation for system i686-linux
warning: request for mips64el-linux derivation for wine-minimal produced a derivation for system i686-linux
warning: request for mips64el-linux derivation for wine produced a derivation for system i686-linux
warning: request for mips64el-linux derivation for mes-minimal produced a derivation for system i686-linux
warning: request for mips64el-linux derivation for memtest86+ produced a derivation for system i686-linux
warning: request for mips64el-linux derivation for gens-gs produced a derivation for system i686-linux
warning: request for mips64el-linux derivation for dev86 produced a derivation for system i686-linux
warning: request for mips64el-linux derivation for ada-ed produced a derivation for system i686-linux
debug: Finished getting derivations for ((mips64el-linux . #f)), took 4 seconds
heap size: 102.0 MiB
debug: Starting getting derivations for ((i586-gnu . #f))
guix repl: warning: 'nix-protocol-error?' is deprecated, use 'store-protocol-error?' instead
guix repl: warning: 'nix-protocol-error-message' is deprecated, use 'store-protocol-error-message' instead
warning: request for i586-gnu derivation for wine-staging produced a derivation for system i686-linux
warning: request for i586-gnu derivation for wine-minimal produced a derivation for system i686-linux
warning: request for i586-gnu derivation for wine produced a derivation for system i686-linux
warning: request for i586-gnu derivation for mes-minimal produced a derivation for system i686-linux
warning: request for i586-gnu derivation for memtest86+ produced a derivation for system i686-linux
warning: request for i586-gnu derivation for gens-gs produced a derivation for system i686-linux
warning: request for i586-gnu derivation for dev86 produced a derivation for system i686-linux
warning: request for i586-gnu derivation for ada-ed produced a derivation for system i686-linux
debug: Finished getting derivations for ((i586-gnu . #f)), took 6 seconds
heap size: 118.0 MiB
debug: Starting getting derivations for ((x86_64-linux . arm-linux-gnueabihf) (x86_64-linux . aarch64-linux-gnu) (x86_64-linux . powerpc-linux-gnu) (x86_64-linux . riscv64-linux-gnu) (x86_64-linux . i586-pc-gnu))
guix repl: warning: 'nix-protocol-error?' is deprecated, use 'store-protocol-error?' instead
guix repl: warning: 'nix-protocol-error-message' is deprecated, use 'store-protocol-error-message' instead
warning: request for x86_64-linux derivation for wine-minimal produced a derivation for system i686-linux
warning: request for x86_64-linux derivation for ada-ed produced a derivation for system i686-linux
warning: request for x86_64-linux derivation for ada-ed produced a derivation for system i686-linux
debug: Finished getting derivations for ((x86_64-linux . arm-linux-gnueabihf) (x86_64-linux . aarch64-linux-gnu) (x86_64-linux . powerpc-linux-gnu) (x86_64-linux . riscv64-linux-gnu) (x86_64-linux . i586-pc-gnu)), took 83 seconds
debug: Finished getting inferior derivations, took 107 seconds
debug: Starting getting inferior system tests
debug: Starting getting system tests
guix repl: warning: 'nix-protocol-error?' is deprecated, use 'store-protocol-error?' instead
guix repl: warning: 'nix-protocol-error-message' is deprecated, use 'store-protocol-error-message' instead
guix-data-service: computing derivation for mpd system test
guix-data-service: computing derivation for cleanup system test
guix-data-service: computing derivation for nss-mdns system test
guix-data-service: computing derivation for mcron system test
guix-data-service: computing derivation for basic system test
guix-data-service: computing derivation for halt system test
guix-data-service: computing derivation for cuirass-remote system test
guix-data-service: computing derivation for cuirass system test
guix-data-service: computing derivation for cups system test
guix-data-service: computing derivation for memcached system test
guix-data-service: computing derivation for mysql system test
guix-data-service: computing derivation for postgresql system test
guix-data-service: computing derivation for mongodb system test
guix-data-service: computing derivation for elogind system test
guix-data-service: computing derivation for dicod system test
guix-data-service: computing derivation for docker-system system test
guix-data-service: computing derivation for docker system test
guix-data-service: computing derivation for ganeti-lxc system test
guix-data-service: computing derivation for ganeti-kvm system test
guix-data-service: computing derivation for guix-build-coordinator system test
guix-data-service: computing derivation for guix-data-service system test
guix-data-service: computing derivation for iso-image-installer system test
guix-data-service: computing derivation for encrypted-root-not-boot-os system test
guix-data-service: computing derivation for separate-home-os system test
guix-data-service: computing derivation for installed-extlinux-os system test
guix-data-service: computing derivation for jfs-root-os system test
guix-data-service: computing derivation for lvm-separate-home-os system test
guix-data-service: computing derivation for gui-installed-os system test
guix-data-service: computing derivation for encrypted-root-os system test
guix-data-service: computing derivation for btrfs-root-on-subvolume-os system test
guix-data-service: computing derivation for separate-store-os system test
guix-data-service: computing derivation for btrfs-raid-root-os system test
guix-data-service: computing derivation for f2fs-root-os system test
guix-data-service: computing derivation for installed-os system test
guix-data-service: computing derivation for btrfs-root-os system test
guix-data-service: computing derivation for gui-installed-os-encrypted system test
guix-data-service: computing derivation for gui-installed-desktop-os-encrypted system test
guix-data-service: computing derivation for raid-root-os system test
guix-data-service: computing derivation for ldap system test
guix-data-service: computing derivation for loadable-kernel-modules-2 system test
guix-data-service: computing derivation for loadable-kernel-modules-1 system test
guix-data-service: computing derivation for loadable-kernel-modules-0 system test
guix-data-service: computing derivation for opensmtpd system test
guix-data-service: computing derivation for exim system test
guix-data-service: computing derivation for getmail system test
guix repl: warning: the following accounts appear more than once: alice
guix repl: warning: the following accounts appear more than once: alice
guix repl: warning: the following accounts appear more than once: alice
guix repl: warning: the following accounts appear more than once: alice
guix repl: warning: the following accounts appear more than once: alice
guix repl: warning: the following accounts appear more than once: alice
guix-data-service: computing derivation for dovecot system test
guix-data-service: computing derivation for prosody system test
guix-data-service: computing derivation for quassel system test
guix-data-service: computing derivation for bitlbee system test
guix-data-service: computing derivation for zabbix system test
guix repl: warning: the following accounts appear more than once: zabbix
guix repl: warning: the following groups appear more than once: zabbix
hint: gnu/tests/monitoring.scm:319:19: zabbix-front-end-configuration: Consider using `db-secret-file' instead of `db-password' for better security.

guix repl: warning: the following accounts appear more than once: zabbix
guix repl: warning: the following groups appear more than once: zabbix
hint: gnu/tests/monitoring.scm:319:19: zabbix-front-end-configuration: Consider using `db-secret-file' instead of `db-password' for better security.

guix repl: warning: the following accounts appear more than once: zabbix
guix repl: warning: the following groups appear more than once: zabbix
hint: gnu/tests/monitoring.scm:319:19: zabbix-front-end-configuration: Consider using `db-secret-file' instead of `db-password' for better security.

guix repl: warning: the following accounts appear more than once: zabbix
guix repl: warning: the following groups appear more than once: zabbix
hint: gnu/tests/monitoring.scm:319:19: zabbix-front-end-configuration: Consider using `db-secret-file' instead of `db-password' for better security.

guix repl: warning: the following accounts appear more than once: zabbix
guix repl: warning: the following groups appear more than once: zabbix
hint: gnu/tests/monitoring.scm:319:19: zabbix-front-end-configuration: Consider using `db-secret-file' instead of `db-password' for better security.

guix repl: warning: the following accounts appear more than once: zabbix
guix repl: warning: the following groups appear more than once: zabbix
hint: gnu/tests/monitoring.scm:319:19: zabbix-front-end-configuration: Consider using `db-secret-file' instead of `db-password' for better security.

guix-data-service: computing derivation for prometheus-node-exporter system test
guix-data-service: computing derivation for tor system test
guix-data-service: computing derivation for dhcpd system test
guix-data-service: computing derivation for openvswitch system test
guix-data-service: computing derivation for iptables system test
guix-data-service: computing derivation for inetd system test
guix-data-service: computing derivation for nfs-root-fs system test
guix-data-service: computing derivation for nfs system test
guix-data-service: computing derivation for nfs-server system test
guix-data-service: computing derivation for nix system test
guix-data-service: computing derivation for upgrade-services system test
guix-data-service: computing derivation for switch-to-system system test
guix-data-service: computing derivation for install-bootloader system test
guix-data-service: computing derivation for rsync system test
guix-data-service: computing derivation for pcscd system test
guix-data-service: computing derivation for singularity system test
guix-data-service: computing derivation for dropbear system test
guix-data-service: computing derivation for openssh system test
guix-data-service: computing derivation for git-http system test
guix-data-service: computing derivation for cgit system test
guix-data-service: computing derivation for gitolite system test
guix-data-service: computing derivation for libvirt system test
guix-data-service: computing derivation for childhurd system test
guix-data-service: computing derivation for varnish system test
guix-data-service: computing derivation for patchwork system test
guix repl: warning: the following accounts appear more than once: httpd
guix repl: warning: the following accounts appear more than once: httpd
guix repl: warning: the following accounts appear more than once: httpd
guix repl: warning: the following accounts appear more than once: httpd
guix repl: warning: the following accounts appear more than once: httpd
guix repl: warning: the following accounts appear more than once: httpd
guix-data-service: computing derivation for php-fpm system test
guix-data-service: computing derivation for httpd system test
guix-data-service: computing derivation for nginx system test
guix-data-service: computing derivation for tailon system test
guix-data-service: computing derivation for hpcguix-web system test
debug: Finished getting system tests, took 210 seconds
debug: Finished getting inferior system tests, took 210 seconds
debug: Starting acquiring advisory transaction lock: load-new-guix-revision-inserts
debug: Finished acquiring advisory transaction lock: load-new-guix-revision-inserts, took 4268 seconds
debug: Starting fetching inferior package license metadata
debug: Finished fetching inferior package license metadata, took 7 seconds
debug: Starting fetching inferior package metadata
debug: Starting populating temp_package_metadata
debug: Finished populating temp_package_metadata, took 1 seconds
debug: Starting querying the temp_package_metadata
debug: Finished querying the temp_package_metadata, took 1267 seconds
debug: Finished fetching inferior package metadata, took 1692 seconds
debug: Starting fetching package metadata tsvector entries
debug: Finished fetching package metadata tsvector entries, took 0 seconds
debug: Starting getting package-ids
debug: Finished getting package-ids, took 1 seconds
debug: finished loading information from inferior
debug: derivation-file-names->derivation-ids: processing 6 derivations
debug: derivation-file-names->vhash: 6 file-names
debug: derivation-file-names->vhash: lookup 6 file-names, 6 not cached
debug: derivation-file-names->vhash: adding 6 entries to the cache
debug: derivation-file-names->derivation-ids: processing 6 derivations
debug: derivation-file-names->vhash: 6 file-names
debug: derivation-file-names->vhash: lookup 6 file-names, 6 not cached
debug: derivation-file-names->vhash: adding 6 entries to the cache
debug: derivation-file-names->derivation-ids: processing 6 derivations
debug: derivation-file-names->vhash: 6 file-names
debug: derivation-file-names->vhash: lookup 6 file-names, 6 not cached
debug: derivation-file-names->vhash: adding 6 entries to the cache
debug: derivation-file-names->derivation-ids: processing 6 derivations
debug: derivation-file-names->vhash: 6 file-names
debug: derivation-file-names->vhash: lookup 6 file-names, 6 not cached
debug: derivation-file-names->vhash: adding 6 entries to the cache
debug: derivation-file-names->derivation-ids: processing 6 derivations
debug: derivation-file-names->vhash: 6 file-names
debug: derivation-file-names->vhash: lookup 6 file-names, 6 not cached
debug: derivation-file-names->vhash: adding 6 entries to the cache
debug: derivation-file-names->derivation-ids: processing 6 derivations
debug: derivation-file-names->vhash: 6 file-names
debug: derivation-file-names->vhash: lookup 6 file-names, 6 not cached
debug: derivation-file-names->vhash: adding 6 entries to the cache
debug: derivation-file-names->derivation-ids: processing 6 derivations
debug: derivation-file-names->vhash: 6 file-names
debug: derivation-file-names->vhash: lookup 6 file-names, 6 not cached
debug: derivation-file-names->vhash: adding 6 entries to the cache
debug: derivation-file-names->derivation-ids: processing 6 derivations
debug: derivation-file-names->vhash: 6 file-names
debug: derivation-file-names->vhash: lookup 6 file-names, 6 not cached
debug: derivation-file-names->vhash: adding 6 entries to the cache
debug: derivation-file-names->derivation-ids: processing 6 derivations
debug: derivation-file-names->vhash: 6 file-names
debug: derivation-file-names->vhash: lookup 6 file-names, 6 not cached
debug: derivation-file-names->vhash: adding 6 entries to the cache
debug: derivation-file-names->derivation-ids: processing 6 derivations
debug: derivation-file-names->vhash: 6 file-names
debug: derivation-file-names->vhash: lookup 6 file-names, 6 not cached
debug: derivation-file-names->vhash: adding 6 entries to the cache
debug: derivation-file-names->derivation-ids: processing 6 derivations
debug: derivation-file-names->vhash: 6 file-names
debug: derivation-file-names->vhash: lookup 6 file-names, 6 not cached
debug: derivation-file-names->vhash: adding 6 entries to the cache
debug: derivation-file-names->derivation-ids: processing 6 derivations
debug: derivation-file-names->vhash: 6 file-names
debug: derivation-file-names->vhash: lookup 6 file-names, 6 not cached
debug: derivation-file-names->vhash: adding 6 entries to the cache
debug: derivation-file-names->derivation-ids: processing 6 derivations
debug: derivation-file-names->vhash: 6 file-names
debug: derivation-file-names->vhash: lookup 6 file-names, 6 not cached
debug: derivation-file-names->vhash: adding 6 entries to the cache
debug: derivation-file-names->derivation-ids: processing 6 derivations
debug: derivation-file-names->vhash: 6 file-names
debug: derivation-file-names->vhash: lookup 6 file-names, 6 not cached
debug: derivation-file-names->vhash: adding 6 entries to the cache
debug: derivation-file-names->derivation-ids: processing 6 derivations
debug: derivation-file-names->vhash: 6 file-names
debug: derivation-file-names->vhash: lookup 6 file-names, 6 not cached
debug: derivation-file-names->vhash: adding 6 entries to the cache
debug: derivation-file-names->derivation-ids: processing 6 derivations
debug: derivation-file-names->vhash: 6 file-names
debug: derivation-file-names->vhash: lookup 6 file-names, 6 not cached
debug: derivation-file-names->vhash: adding 6 entries to the cache
debug: derivation-file-names->derivation-ids: processing 6 derivations
debug: derivation-file-names->vhash: 6 file-names
debug: derivation-file-names->vhash: lookup 6 file-names, 6 not cached
debug: derivation-file-names->vhash: adding 6 entries to the cache
debug: derivation-file-names->derivation-ids: processing 6 derivations
debug: derivation-file-names->vhash: 6 file-names
debug: derivation-file-names->vhash: lookup 6 file-names, 6 not cached
debug: derivation-file-names->vhash: adding 6 entries to the cache
debug: derivation-file-names->derivation-ids: processing 6 derivations
debug: derivation-file-names->vhash: 6 file-names
debug: derivation-file-names->vhash: lookup 6 file-names, 6 not cached
debug: derivation-file-names->vhash: adding 6 entries to the cache
debug: derivation-file-names->derivation-ids: processing 6 derivations
debug: derivation-file-names->vhash: 6 file-names
debug: derivation-file-names->vhash: lookup 6 file-names, 6 not cached
debug: derivation-file-names->vhash: adding 6 entries to the cache
debug: derivation-file-names->derivation-ids: processing 6 derivations
debug: derivation-file-names->vhash: 6 file-names
debug: derivation-file-names->vhash: lookup 6 file-names, 6 not cached
debug: derivation-file-names->vhash: adding 6 entries to the cache
debug: derivation-file-names->derivation-ids: processing 6 derivations
debug: derivation-file-names->vhash: 6 file-names
debug: derivation-file-names->vhash: lookup 6 file-names, 6 not cached
debug: derivation-file-names->vhash: adding 0 entries to the cache
debug: insert-missing-derivations: inserting 6 derivations
debug: insert-missing-derivations: updating hash table
debug: insert-missing-derivations: inserting outputs
debug: insert-missing-derivations: inserting sources
debug: insert-missing-derivations: ensure-input-derivations-exist
debug: ensure-input-derivations-exist: processing 144 derivations
debug: derivation-file-names->vhash: 144 file-names
debug: derivation-file-names->vhash: lookup 144 file-names, 144 not cached
debug: derivation-file-names->vhash: adding 138 entries to the cache
debug: ensure-input-derivations-exist: checking for missing input derivations
debug: insert-missing-derivations: inserting 6 derivations
debug: insert-missing-derivations: updating hash table
debug: insert-missing-derivations: inserting outputs
debug: insert-missing-derivations: inserting sources
debug: insert-missing-derivations: ensure-input-derivations-exist
debug: ensure-input-derivations-exist: processing 24 derivations
debug: derivation-file-names->vhash: 24 file-names
debug: derivation-file-names->vhash: lookup 24 file-names, 12 not cached
debug: derivation-file-names->vhash: adding 6 entries to the cache
debug: ensure-input-derivations-exist: checking for missing input derivations
debug: insert-missing-derivations: inserting 6 derivations
debug: insert-missing-derivations: updating hash table
debug: insert-missing-derivations: inserting outputs
debug: insert-missing-derivations: inserting sources
debug: insert-missing-derivations: ensure-input-derivations-exist
debug: ensure-input-derivations-exist: processing 108 derivations
debug: derivation-file-names->vhash: 108 file-names
debug: derivation-file-names->vhash: lookup 108 file-names, 84 not cached
debug: derivation-file-names->vhash: adding 72 entries to the cache
debug: ensure-input-derivations-exist: checking for missing input derivations
debug: insert-missing-derivations: inserting 12 derivations
debug: insert-missing-derivations: updating hash table
debug: insert-missing-derivations: inserting outputs
debug: insert-missing-derivations: inserting sources
debug: insert-missing-derivations: ensure-input-derivations-exist
debug: ensure-input-derivations-exist: processing 84 derivations
debug: derivation-file-names->vhash: 84 file-names
debug: derivation-file-names->vhash: lookup 84 file-names, 72 not cached
debug: derivation-file-names->vhash: adding 60 entries to the cache
debug: ensure-input-derivations-exist: checking for missing input derivations
debug: insert-missing-derivations: inserting 12 derivations
debug: insert-missing-derivations: updating hash table
debug: insert-missing-derivations: inserting outputs
debug: insert-missing-derivations: inserting sources
debug: insert-missing-derivations: ensure-input-derivations-exist
debug: ensure-input-derivations-exist: processing 588 derivations
debug: derivation-file-names->vhash: 588 file-names
debug: derivation-file-names->vhash: lookup 588 file-names, 420 not cached
debug: derivation-file-names->vhash: adding 360 entries to the cache
debug: ensure-input-derivations-exist: checking for missing input derivations
debug: insert-missing-derivations: inserting 60 derivations
debug: insert-missing-derivations: updating hash table
debug: insert-missing-derivations: inserting outputs
debug: insert-missing-derivations: inserting sources
debug: insert-missing-derivations: ensure-input-derivations-exist
debug: ensure-input-derivations-exist: processing 1123 derivations
debug: derivation-file-names->vhash: 1123 file-names
debug: derivation-file-names->vhash: lookup 1123 file-names, 589 not cached
debug: derivation-file-names->vhash: adding 577 entries to the cache
debug: ensure-input-derivations-exist: checking for missing input derivations
debug: insert-missing-derivations: inserting 12 derivations
debug: insert-missing-derivations: updating hash table
debug: insert-missing-derivations: inserting outputs
debug: insert-missing-derivations: inserting sources
debug: insert-missing-derivations: ensure-input-derivations-exist
debug: ensure-input-derivations-exist: processing 42 derivations
debug: derivation-file-names->vhash: 42 file-names
debug: derivation-file-names->vhash: lookup 42 file-names, 12 not cached
debug: derivation-file-names->vhash: adding 6 entries to the cache
debug: ensure-input-derivations-exist: checking for missing input derivations
debug: insert-missing-derivations: inserting 6 derivations
debug: insert-missing-derivations: updating hash table
debug: insert-missing-derivations: inserting outputs
debug: insert-missing-derivations: inserting sources
debug: insert-missing-derivations: ensure-input-derivations-exist
debug: ensure-input-derivations-exist: processing 30 derivations
debug: derivation-file-names->vhash: 30 file-names
debug: derivation-file-names->vhash: lookup 30 file-names, 12 not cached
debug: derivation-file-names->vhash: adding 12 entries to the cache
debug: ensure-input-derivations-exist: checking for missing input derivations
debug: insert-missing-derivations: inserting inputs
debug: insert-missing-derivations: inserting inputs
debug: insert-missing-derivations: inserting inputs
debug: insert-missing-derivations: inserting inputs
debug: insert-missing-derivations: inserting inputs
debug: insert-missing-derivations: inserting inputs
debug: insert-missing-derivations: inserting inputs
debug: insert-missing-derivations: inserting inputs
debug: derivation-file-names->derivation-ids: processing 6 derivations
debug: derivation-file-names->vhash: 6 file-names
debug: derivation-file-names->vhash: lookup 6 file-names, 6 not cached
debug: derivation-file-names->vhash: adding 0 entries to the cache
debug: insert-missing-derivations: inserting 6 derivations
debug: insert-missing-derivations: updating hash table
debug: insert-missing-derivations: inserting outputs
debug: insert-missing-derivations: inserting sources
debug: insert-missing-derivations: ensure-input-derivations-exist
debug: ensure-input-derivations-exist: processing 144 derivations
debug: derivation-file-names->vhash: 144 file-names
debug: derivation-file-names->vhash: lookup 144 file-names, 144 not cached
debug: derivation-file-names->vhash: adding 138 entries to the cache
debug: ensure-input-derivations-exist: checking for missing input derivations
debug: insert-missing-derivations: inserting 6 derivations
debug: insert-missing-derivations: updating hash table
debug: insert-missing-derivations: inserting outputs
debug: insert-missing-derivations: inserting sources
debug: insert-missing-derivations: ensure-input-derivations-exist
debug: ensure-input-derivations-exist: processing 24 derivations
debug: derivation-file-names->vhash: 24 file-names
debug: derivation-file-names->vhash: lookup 24 file-names, 12 not cached
debug: derivation-file-names->vhash: adding 6 entries to the cache
debug: ensure-input-derivations-exist: checking for missing input derivations
debug: insert-missing-derivations: inserting 6 derivations
debug: insert-missing-derivations: updating hash table
debug: insert-missing-derivations: inserting outputs
debug: insert-missing-derivations: inserting sources
debug: insert-missing-derivations: ensure-input-derivations-exist
debug: ensure-input-derivations-exist: processing 66 derivations
debug: derivation-file-names->vhash: 66 file-names
debug: derivation-file-names->vhash: lookup 66 file-names, 36 not cached
debug: derivation-file-names->vhash: adding 30 entries to the cache
debug: ensure-input-derivations-exist: checking for missing input derivations
debug: insert-missing-derivations: inserting 6 derivations
debug: insert-missing-derivations: updating hash table
debug: insert-missing-derivations: inserting outputs
debug: insert-missing-derivations: inserting sources
debug: insert-missing-derivations: ensure-input-derivations-exist
debug: ensure-input-derivations-exist: processing 18 derivations
debug: derivation-file-names->vhash: 18 file-names
debug: derivation-file-names->vhash: lookup 18 file-names, 12 not cached
debug: derivation-file-names->vhash: adding 0 entries to the cache
debug: ensure-input-derivations-exist: checking for missing input derivations
debug: insert-missing-derivations: inserting 12 derivations
debug: insert-missing-derivations: updating hash table
debug: insert-missing-derivations: inserting outputs
debug: insert-missing-derivations: inserting sources
debug: insert-missing-derivations: ensure-input-derivations-exist
debug: ensure-input-derivations-exist: processing 84 derivations
debug: derivation-file-names->vhash: 84 file-names
debug: derivation-file-names->vhash: lookup 84 file-names, 48 not cached
debug: derivation-file-names->vhash: adding 36 entries to the cache
debug: ensure-input-derivations-exist: checking for missing input derivations
debug: insert-missing-derivations: inserting 12 derivations
debug: insert-missing-derivations: updating hash table
debug: insert-missing-derivations: inserting outputs
debug: insert-missing-derivations: inserting sources
debug: insert-missing-derivations: ensure-input-derivations-exist
debug: ensure-input-derivations-exist: processing 84 derivations
debug: derivation-file-names->vhash: 84 file-names
debug: derivation-file-names->vhash: lookup 84 file-names, 72 not cached
debug: derivation-file-names->vhash: adding 66 entries to the cache
debug: ensure-input-derivations-exist: checking for missing input derivations
debug: insert-missing-derivations: inserting 6 derivations
debug: insert-missing-derivations: updating hash table
debug: insert-missing-derivations: inserting outputs
debug: insert-missing-derivations: inserting sources
debug: insert-missing-derivations: ensure-input-derivations-exist
debug: ensure-input-derivations-exist: processing 36 derivations
debug: derivation-file-names->vhash: 36 file-names
debug: derivation-file-names->vhash: lookup 36 file-names, 18 not cached
debug: derivation-file-names->vhash: adding 12 entries to the cache
debug: ensure-input-derivations-exist: checking for missing input derivations
debug: insert-missing-derivations: inserting 6 derivations
debug: insert-missing-derivations: updating hash table
debug: insert-missing-derivations: inserting outputs
debug: insert-missing-derivations: inserting sources
debug: insert-missing-derivations: ensure-input-derivations-exist
debug: ensure-input-derivations-exist: processing 90 derivations
debug: derivation-file-names->vhash: 90 file-names
debug: derivation-file-names->vhash: lookup 90 file-names, 84 not cached
debug: derivation-file-names->vhash: adding 84 entries to the cache
debug: ensure-input-derivations-exist: checking for missing input derivations
debug: insert-missing-derivations: inserting inputs
debug: insert-missing-derivations: inserting inputs
debug: insert-missing-derivations: inserting inputs
debug: insert-missing-derivations: inserting inputs
debug: insert-missing-derivations: inserting inputs
debug: insert-missing-derivations: inserting inputs
debug: insert-missing-derivations: inserting inputs
debug: insert-missing-derivations: inserting inputs
debug: derivation-file-names->derivation-ids: processing 6 derivations
debug: derivation-file-names->vhash: 6 file-names
debug: derivation-file-names->vhash: lookup 6 file-names, 6 not cached
debug: derivation-file-names->vhash: adding 0 entries to the cache
debug: insert-missing-derivations: inserting 6 derivations
debug: insert-missing-derivations: updating hash table
debug: insert-missing-derivations: inserting outputs
debug: insert-missing-derivations: inserting sources
debug: insert-missing-derivations: ensure-input-derivations-exist
debug: ensure-input-derivations-exist: processing 144 derivations
debug: derivation-file-names->vhash: 144 file-names
debug: derivation-file-names->vhash: lookup 144 file-names, 144 not cached
debug: derivation-file-names->vhash: adding 138 entries to the cache
debug: ensure-input-derivations-exist: checking for missing input derivations
debug: insert-missing-derivations: inserting 6 derivations
debug: insert-missing-derivations: updating hash table
debug: insert-missing-derivations: inserting outputs
debug: insert-missing-derivations: inserting sources
debug: insert-missing-derivations: ensure-input-derivations-exist
debug: ensure-input-derivations-exist: processing 24 derivations
debug: derivation-file-names->vhash: 24 file-names
debug: derivation-file-names->vhash: lookup 24 file-names, 12 not cached
debug: derivation-file-names->vhash: adding 6 entries to the cache
debug: ensure-input-derivations-exist: checking for missing input derivations
debug: insert-missing-derivations: inserting 6 derivations
debug: insert-missing-derivations: updating hash table
debug: insert-missing-derivations: inserting outputs
debug: insert-missing-derivations: inserting sources
debug: insert-missing-derivations: ensure-input-derivations-exist
debug: ensure-input-derivations-exist: processing 66 derivations
debug: derivation-file-names->vhash: 66 file-names
debug: derivation-file-names->vhash: lookup 66 file-names, 36 not cached
debug: derivation-file-names->vhash: adding 30 entries to the cache
debug: ensure-input-derivations-exist: checking for missing input derivations
debug: insert-missing-derivations: inserting 6 derivations
debug: insert-missing-derivations: updating hash table
debug: insert-missing-derivations: inserting outputs
debug: insert-missing-derivations: inserting sources
debug: insert-missing-derivations: ensure-input-derivations-exist
debug: ensure-input-derivations-exist: processing 18 derivations
debug: derivation-file-names->vhash: 18 file-names
debug: derivation-file-names->vhash: lookup 18 file-names, 12 not cached
debug: derivation-file-names->vhash: adding 0 entries to the cache
debug: ensure-input-derivations-exist: checking for missing input derivations
debug: insert-missing-derivations: inserting 12 derivations
debug: insert-missing-derivations: updating hash table
debug: insert-missing-derivations: inserting outputs
debug: insert-missing-derivations: inserting sources
debug: insert-missing-derivations: ensure-input-derivations-exist
debug: ensure-input-derivations-exist: processing 84 derivations
debug: derivation-file-names->vhash: 84 file-names
debug: derivation-file-names->vhash: lookup 84 file-names, 48 not cached
debug: derivation-file-names->vhash: adding 36 entries to the cache
debug: ensure-input-derivations-exist: checking for missing input derivations
debug: insert-missing-derivations: inserting 12 derivations
debug: insert-missing-derivations: updating hash table
debug: insert-missing-derivations: inserting outputs
debug: insert-missing-derivations: inserting sources
debug: insert-missing-derivations: ensure-input-derivations-exist
debug: ensure-input-derivations-exist: processing 84 derivations
debug: derivation-file-names->vhash: 84 file-names
debug: derivation-file-names->vhash: lookup 84 file-names, 72 not cached
debug: derivation-file-names->vhash: adding 72 entries to the cache
debug: ensure-input-derivations-exist: checking for missing input derivations
debug: insert-missing-derivations: inserting inputs
debug: insert-missing-derivations: inserting inputs
debug: insert-missing-derivations: inserting inputs
debug: insert-missing-derivations: inserting inputs
debug: insert-missing-derivations: inserting inputs
debug: insert-missing-derivations: inserting inputs
debug: derivation-file-names->derivation-ids: processing 6 derivations
debug: derivation-file-names->vhash: 6 file-names
debug: derivation-file-names->vhash: lookup 6 file-names, 6 not cached
debug: derivation-file-names->vhash: adding 0 entries to the cache
debug: insert-missing-derivations: inserting 6 derivations
debug: insert-missing-derivations: updating hash table
debug: insert-missing-derivations: inserting outputs
debug: insert-missing-derivations: inserting sources
debug: insert-missing-derivations: ensure-input-derivations-exist
debug: ensure-input-derivations-exist: processing 144 derivations
debug: derivation-file-names->vhash: 144 file-names
debug: derivation-file-names->vhash: lookup 144 file-names, 144 not cached
debug: derivation-file-names->vhash: adding 138 entries to the cache
debug: ensure-input-derivations-exist: checking for missing input derivations
debug: insert-missing-derivations: inserting 6 derivations
debug: insert-missing-derivations: updating hash table
debug: insert-missing-derivations: inserting outputs
debug: insert-missing-derivations: inserting sources
debug: insert-missing-derivations: ensure-input-derivations-exist
debug: ensure-input-derivations-exist: processing 24 derivations
debug: derivation-file-names->vhash: 24 file-names
debug: derivation-file-names->vhash: lookup 24 file-names, 12 not cached
debug: derivation-file-names->vhash: adding 6 entries to the cache
debug: ensure-input-derivations-exist: checking for missing input derivations
debug: insert-missing-derivations: inserting 6 derivations
debug: insert-missing-derivations: updating hash table
debug: insert-missing-derivations: inserting outputs
debug: insert-missing-derivations: inserting sources
debug: insert-missing-derivations: ensure-input-derivations-exist
debug: ensure-input-derivations-exist: processing 66 derivations
debug: derivation-file-names->vhash: 66 file-names
debug: derivation-file-names->vhash: lookup 66 file-names, 36 not cached
debug: derivation-file-names->vhash: adding 30 entries to the cache
debug: ensure-input-derivations-exist: checking for missing input derivations
debug: insert-missing-derivations: inserting 6 derivations
debug: insert-missing-derivations: updating hash table
debug: insert-missing-derivations: inserting outputs
debug: insert-missing-derivations: inserting sources
debug: insert-missing-derivations: ensure-input-derivations-exist
debug: ensure-input-derivations-exist: processing 18 derivations
debug: derivation-file-names->vhash: 18 file-names
debug: derivation-file-names->vhash: lookup 18 file-names, 12 not cached
debug: derivation-file-names->vhash: adding 0 entries to the cache
debug: ensure-input-derivations-exist: checking for missing input derivations
debug: insert-missing-derivations: inserting 12 derivations
debug: insert-missing-derivations: updating hash table
debug: insert-missing-derivations: inserting outputs
debug: insert-missing-derivations: inserting sources
debug: insert-missing-derivations: ensure-input-derivations-exist
debug: ensure-input-derivations-exist: processing 84 derivations
debug: derivation-file-names->vhash: 84 file-names
debug: derivation-file-names->vhash: lookup 84 file-names, 48 not cached
debug: derivation-file-names->vhash: adding 36 entries to the cache
debug: ensure-input-derivations-exist: checking for missing input derivations
debug: insert-missing-derivations: inserting 12 derivations
debug: insert-missing-derivations: updating hash table
debug: insert-missing-derivations: inserting outputs
debug: insert-missing-derivations: inserting sources
debug: insert-missing-derivations: ensure-input-derivations-exist
debug: ensure-input-derivations-exist: processing 84 derivations
debug: derivation-file-names->vhash: 84 file-names
debug: derivation-file-names->vhash: lookup 84 file-names, 72 not cached
debug: derivation-file-names->vhash: adding 66 entries to the cache
debug: ensure-input-derivations-exist: checking for missing input derivations
debug: insert-missing-derivations: inserting 6 derivations
debug: insert-missing-derivations: updating hash table
debug: insert-missing-derivations: inserting outputs
debug: insert-missing-derivations: inserting sources
debug: insert-missing-derivations: ensure-input-derivations-exist
debug: ensure-input-derivations-exist: processing 576 derivations
debug: derivation-file-names->vhash: 576 file-names
debug: derivation-file-names->vhash: lookup 576 file-names, 432 not cached
debug: derivation-file-names->vhash: adding 390 entries to the cache
debug: ensure-input-derivations-exist: checking for missing input derivations
debug: insert-missing-derivations: inserting 42 derivations
debug: insert-missing-derivations: updating hash table
debug: insert-missing-derivations: inserting outputs
debug: insert-missing-derivations: inserting sources
debug: insert-missing-derivations: ensure-input-derivations-exist
debug: ensure-input-derivations-exist: processing 600 derivations
debug: derivation-file-names->vhash: 600 file-names
debug: derivation-file-names->vhash: lookup 600 file-names, 60 not cached
debug: derivation-file-names->vhash: adding 60 entries to the cache
debug: ensure-input-derivations-exist: checking for missing input derivations
debug: insert-missing-derivations: inserting inputs
debug: insert-missing-derivations: inserting inputs
debug: insert-missing-derivations: inserting inputs
debug: insert-missing-derivations: inserting inputs
debug: insert-missing-derivations: inserting inputs
debug: insert-missing-derivations: inserting inputs
debug: insert-missing-derivations: inserting inputs
debug: insert-missing-derivations: inserting inputs
debug: derivation-file-names->derivation-ids: processing 6 derivations
debug: derivation-file-names->vhash: 6 file-names
debug: derivation-file-names->vhash: lookup 6 file-names, 6 not cached
debug: derivation-file-names->vhash: adding 0 entries to the cache
debug: insert-missing-derivations: inserting 6 derivations
debug: insert-missing-derivations: updating hash table
debug: insert-missing-derivations: inserting outputs
debug: insert-missing-derivations: inserting sources
debug: insert-missing-derivations: ensure-input-derivations-exist
debug: ensure-input-derivations-exist: processing 144 derivations
debug: derivation-file-names->vhash: 144 file-names
debug: derivation-file-names->vhash: lookup 144 file-names, 144 not cached
debug: derivation-file-names->vhash: adding 138 entries to the cache
debug: ensure-input-derivations-exist: checking for missing input derivations
debug: insert-missing-derivations: inserting 6 derivations
debug: insert-missing-derivations: updating hash table
debug: insert-missing-derivations: inserting outputs
debug: insert-missing-derivations: inserting sources
debug: insert-missing-derivations: ensure-input-derivations-exist
debug: ensure-input-derivations-exist: processing 24 derivations
debug: derivation-file-names->vhash: 24 file-names
debug: derivation-file-names->vhash: lookup 24 file-names, 12 not cached
debug: derivation-file-names->vhash: adding 6 entries to the cache
debug: ensure-input-derivations-exist: checking for missing input derivations
debug: insert-missing-derivations: inserting 6 derivations
debug: insert-missing-derivations: updating hash table
debug: insert-missing-derivations: inserting outputs
debug: insert-missing-derivations: inserting sources
debug: insert-missing-derivations: ensure-input-derivations-exist
debug: ensure-input-derivations-exist: processing 66 derivations
debug: derivation-file-names->vhash: 66 file-names
debug: derivation-file-names->vhash: lookup 66 file-names, 36 not cached
debug: derivation-file-names->vhash: adding 30 entries to the cache
debug: ensure-input-derivations-exist: checking for missing input derivations
debug: insert-missing-derivations: inserting 6 derivations
debug: insert-missing-derivations: updating hash table
debug: insert-missing-derivations: inserting outputs
debug: insert-missing-derivations: inserting sources
debug: insert-missing-derivations: ensure-input-derivations-exist
debug: ensure-input-derivations-exist: processing 18 derivations
debug: derivation-file-names->vhash: 18 file-names
debug: derivation-file-names->vhash: lookup 18 file-names, 12 not cached
debug: derivation-file-names->vhash: adding 0 entries to the cache
debug: ensure-input-derivations-exist: checking for missing input derivations
debug: insert-missing-derivations: inserting 12 derivations
debug: insert-missing-derivations: updating hash table
debug: insert-missing-derivations: inserting outputs
debug: insert-missing-derivations: inserting sources
debug: insert-missing-derivations: ensure-input-derivations-exist
debug: ensure-input-derivations-exist: processing 84 derivations
debug: derivation-file-names->vhash: 84 file-names
debug: derivation-file-names->vhash: lookup 84 file-names, 48 not cached
debug: derivation-file-names->vhash: adding 36 entries to the cache
debug: ensure-input-derivations-exist: checking for missing input derivations
debug: insert-missing-derivations: inserting 12 derivations
debug: insert-missing-derivations: updating hash table
debug: insert-missing-derivations: inserting outputs
debug: insert-missing-derivations: inserting sources
debug: insert-missing-derivations: ensure-input-derivations-exist
debug: ensure-input-derivations-exist: processing 84 derivations
debug: derivation-file-names->vhash: 84 file-names
debug: derivation-file-names->vhash: lookup 84 file-names, 72 not cached
debug: derivation-file-names->vhash: adding 72 entries to the cache
debug: ensure-input-derivations-exist: checking for missing input derivations
debug: insert-missing-derivations: inserting inputs
debug: insert-missing-derivations: inserting inputs
debug: insert-missing-derivations: inserting inputs
debug: insert-missing-derivations: inserting inputs
debug: insert-missing-derivations: inserting inputs
debug: insert-missing-derivations: inserting inputs
debug: derivation-file-names->derivation-ids: processing 6 derivations
debug: derivation-file-names->vhash: 6 file-names
debug: derivation-file-names->vhash: lookup 6 file-names, 6 not cached
debug: derivation-file-names->vhash: adding 0 entries to the cache
debug: insert-missing-derivations: inserting 6 derivations
debug: insert-missing-derivations: updating hash table
debug: insert-missing-derivations: inserting outputs
debug: insert-missing-derivations: inserting sources
debug: insert-missing-derivations: ensure-input-derivations-exist
debug: ensure-input-derivations-exist: processing 144 derivations
debug: derivation-file-names->vhash: 144 file-names
debug: derivation-file-names->vhash: lookup 144 file-names, 144 not cached
debug: derivation-file-names->vhash: adding 138 entries to the cache
debug: ensure-input-derivations-exist: checking for missing input derivations
debug: insert-missing-derivations: inserting 6 derivations
debug: insert-missing-derivations: updating hash table
debug: insert-missing-derivations: inserting outputs
debug: insert-missing-derivations: inserting sources
debug: insert-missing-derivations: ensure-input-derivations-exist
debug: ensure-input-derivations-exist: processing 24 derivations
debug: derivation-file-names->vhash: 24 file-names
debug: derivation-file-names->vhash: lookup 24 file-names, 12 not cached
debug: derivation-file-names->vhash: adding 6 entries to the cache
debug: ensure-input-derivations-exist: checking for missing input derivations
debug: insert-missing-derivations: inserting 6 derivations
debug: insert-missing-derivations: updating hash table
debug: insert-missing-derivations: inserting outputs
debug: insert-missing-derivations: inserting sources
debug: insert-missing-derivations: ensure-input-derivations-exist
debug: ensure-input-derivations-exist: processing 66 derivations
debug: derivation-file-names->vhash: 66 file-names
debug: derivation-file-names->vhash: lookup 66 file-names, 36 not cached
debug: derivation-file-names->vhash: adding 30 entries to the cache
debug: ensure-input-derivations-exist: checking for missing input derivations
debug: insert-missing-derivations: inserting 6 derivations
debug: insert-missing-derivations: updating hash table
debug: insert-missing-derivations: inserting outputs
debug: insert-missing-derivations: inserting sources
debug: insert-missing-derivations: ensure-input-derivations-exist
debug: ensure-input-derivations-exist: processing 18 derivations
debug: derivation-file-names->vhash: 18 file-names
debug: derivation-file-names->vhash: lookup 18 file-names, 12 not cached
debug: derivation-file-names->vhash: adding 0 entries to the cache
debug: ensure-input-derivations-exist: checking for missing input derivations
debug: insert-missing-derivations: inserting 12 derivations
debug: insert-missing-derivations: updating hash table
debug: insert-missing-derivations: inserting outputs
debug: insert-missing-derivations: inserting sources
debug: insert-missing-derivations: ensure-input-derivations-exist
debug: ensure-input-derivations-exist: processing 84 derivations
debug: derivation-file-names->vhash: 84 file-names
debug: derivation-file-names->vhash: lookup 84 file-names, 48 not cached
debug: derivation-file-names->vhash: adding 36 entries to the cache
debug: ensure-input-derivations-exist: checking for missing input derivations
debug: insert-missing-derivations: inserting 12 derivations
debug: insert-missing-derivations: updating hash table
debug: insert-missing-derivations: inserting outputs
debug: insert-missing-derivations: inserting sources
debug: insert-missing-derivations: ensure-input-derivations-exist
debug: ensure-input-derivations-exist: processing 84 derivations
debug: derivation-file-names->vhash: 84 file-names
debug: derivation-file-names->vhash: lookup 84 file-names, 72 not cached
debug: derivation-file-names->vhash: adding 66 entries to the cache
debug: ensure-input-derivations-exist: checking for missing input derivations
debug: insert-missing-derivations: inserting 6 derivations
debug: insert-missing-derivations: updating hash table
debug: insert-missing-derivations: inserting outputs
debug: insert-missing-derivations: inserting sources
debug: insert-missing-derivations: ensure-input-derivations-exist
debug: ensure-input-derivations-exist: processing 576 derivations
debug: derivation-file-names->vhash: 576 file-names
debug: derivation-file-names->vhash: lookup 576 file-names, 432 not cached
debug: derivation-file-names->vhash: adding 390 entries to the cache
debug: ensure-input-derivations-exist: checking for missing input derivations
debug: insert-missing-derivations: inserting 42 derivations
debug: insert-missing-derivations: updating hash table
debug: insert-missing-derivations: inserting outputs
debug: insert-missing-derivations: inserting sources
debug: insert-missing-derivations: ensure-input-derivations-exist
debug: ensure-input-derivations-exist: processing 600 derivations
debug: derivation-file-names->vhash: 600 file-names
debug: derivation-file-names->vhash: lookup 600 file-names, 60 not cached
debug: derivation-file-names->vhash: adding 60 entries to the cache
debug: ensure-input-derivations-exist: checking for missing input derivations
debug: insert-missing-derivations: inserting inputs
debug: insert-missing-derivations: inserting inputs
debug: insert-missing-derivations: inserting inputs
debug: insert-missing-derivations: inserting inputs
debug: insert-missing-derivations: inserting inputs
debug: insert-missing-derivations: inserting inputs
debug: insert-missing-derivations: inserting inputs
debug: insert-missing-derivations: inserting inputs
debug: derivation-file-names->derivation-ids: processing 6 derivations
debug: derivation-file-names->vhash: 6 file-names
debug: derivation-file-names->vhash: lookup 6 file-names, 6 not cached
debug: derivation-file-names->vhash: adding 0 entries to the cache
debug: insert-missing-derivations: inserting 6 derivations
debug: insert-missing-derivations: updating hash table
debug: insert-missing-derivations: inserting outputs
debug: insert-missing-derivations: inserting sources
debug: insert-missing-derivations: ensure-input-derivations-exist
debug: ensure-input-derivations-exist: processing 144 derivations
debug: derivation-file-names->vhash: 144 file-names
debug: derivation-file-names->vhash: lookup 144 file-names, 144 not cached
debug: derivation-file-names->vhash: adding 138 entries to the cache
debug: ensure-input-derivations-exist: checking for missing input derivations
debug: insert-missing-derivations: inserting 6 derivations
debug: insert-missing-derivations: updating hash table
debug: insert-missing-derivations: inserting outputs
debug: insert-missing-derivations: inserting sources
debug: insert-missing-derivations: ensure-input-derivations-exist
debug: ensure-input-derivations-exist: processing 30 derivations
debug: derivation-file-names->vhash: 30 file-names
debug: derivation-file-names->vhash: lookup 30 file-names, 18 not cached
debug: derivation-file-names->vhash: adding 12 entries to the cache
debug: ensure-input-derivations-exist: checking for missing input derivations
debug: insert-missing-derivations: inserting 6 derivations
debug: insert-missing-derivations: updating hash table
debug: insert-missing-derivations: inserting outputs
debug: insert-missing-derivations: inserting sources
debug: insert-missing-derivations: ensure-input-derivations-exist
debug: ensure-input-derivations-exist: processing 108 derivations
debug: derivation-file-names->vhash: 108 file-names
debug: derivation-file-names->vhash: lookup 108 file-names, 84 not cached
debug: derivation-file-names->vhash: adding 72 entries to the cache
debug: ensure-input-derivations-exist: checking for missing input derivations
debug: insert-missing-derivations: inserting 12 derivations
debug: insert-missing-derivations: updating hash table
debug: insert-missing-derivations: inserting outputs
debug: insert-missing-derivations: inserting sources
debug: insert-missing-derivations: ensure-input-derivations-exist
debug: ensure-input-derivations-exist: processing 84 derivations
debug: derivation-file-names->vhash: 84 file-names
debug: derivation-file-names->vhash: lookup 84 file-names, 72 not cached
debug: derivation-file-names->vhash: adding 60 entries to the cache
debug: ensure-input-derivations-exist: checking for missing input derivations
debug: insert-missing-derivations: inserting 12 derivations
debug: insert-missing-derivations: updating hash table
debug: insert-missing-derivations: inserting outputs
debug: insert-missing-derivations: inserting sources
debug: insert-missing-derivations: ensure-input-derivations-exist
debug: ensure-input-derivations-exist: processing 612 derivations
debug: derivation-file-names->vhash: 612 file-names
debug: derivation-file-names->vhash: lookup 612 file-names, 438 not cached
debug: derivation-file-names->vhash: adding 390 entries to the cache
debug: ensure-input-derivations-exist: checking for missing input derivations
debug: insert-missing-derivations: inserting 48 derivations
debug: insert-missing-derivations: updating hash table
debug: insert-missing-derivations: inserting outputs
debug: insert-missing-derivations: inserting sources
debug: insert-missing-derivations: ensure-input-derivations-exist
debug: ensure-input-derivations-exist: processing 846 derivations
debug: derivation-file-names->vhash: 846 file-names
debug: derivation-file-names->vhash: lookup 846 file-names, 288 not cached
debug: derivation-file-names->vhash: adding 288 entries to the cache
debug: ensure-input-derivations-exist: checking for missing input derivations
debug: insert-missing-derivations: inserting inputs
debug: insert-missing-derivations: inserting inputs
debug: insert-missing-derivations: inserting inputs
debug: insert-missing-derivations: inserting inputs
debug: insert-missing-derivations: inserting inputs
debug: insert-missing-derivations: inserting inputs
debug: derivation-file-names->derivation-ids: processing 6 derivations
debug: derivation-file-names->vhash: 6 file-names
debug: derivation-file-names->vhash: lookup 6 file-names, 6 not cached
debug: derivation-file-names->vhash: adding 0 entries to the cache
debug: insert-missing-derivations: inserting 6 derivations
debug: insert-missing-derivations: updating hash table
debug: insert-missing-derivations: inserting outputs
debug: insert-missing-derivations: inserting sources
debug: insert-missing-derivations: ensure-input-derivations-exist
debug: ensure-input-derivations-exist: processing 144 derivations
debug: derivation-file-names->vhash: 144 file-names
debug: derivation-file-names->vhash: lookup 144 file-names, 144 not cached
debug: derivation-file-names->vhash: adding 138 entries to the cache
debug: ensure-input-derivations-exist: checking for missing input derivations
debug: insert-missing-derivations: inserting 6 derivations
debug: insert-missing-derivations: updating hash table
debug: insert-missing-derivations: inserting outputs
debug: insert-missing-derivations: inserting sources
debug: insert-missing-derivations: ensure-input-derivations-exist
debug: ensure-input-derivations-exist: processing 24 derivations
debug: derivation-file-names->vhash: 24 file-names
debug: derivation-file-names->vhash: lookup 24 file-names, 12 not cached
debug: derivation-file-names->vhash: adding 6 entries to the cache
debug: ensure-input-derivations-exist: checking for missing input derivations
debug: insert-missing-derivations: inserting 6 derivations
debug: insert-missing-derivations: updating hash table
debug: insert-missing-derivations: inserting outputs
debug: insert-missing-derivations: inserting sources
debug: insert-missing-derivations: ensure-input-derivations-exist
debug: ensure-input-derivations-exist: processing 66 derivations
debug: derivation-file-names->vhash: 66 file-names
debug: derivation-file-names->vhash: lookup 66 file-names, 36 not cached
debug: derivation-file-names->vhash: adding 30 entries to the cache
debug: ensure-input-derivations-exist: checking for missing input derivations
debug: insert-missing-derivations: inserting 6 derivations
debug: insert-missing-derivations: updating hash table
debug: insert-missing-derivations: inserting outputs
debug: insert-missing-derivations: inserting sources
debug: insert-missing-derivations: ensure-input-derivations-exist
debug: ensure-input-derivations-exist: processing 18 derivations
debug: derivation-file-names->vhash: 18 file-names
debug: derivation-file-names->vhash: lookup 18 file-names, 12 not cached
debug: derivation-file-names->vhash: adding 0 entries to the cache
debug: ensure-input-derivations-exist: checking for missing input derivations
debug: insert-missing-derivations: inserting 12 derivations
debug: insert-missing-derivations: updating hash table
debug: insert-missing-derivations: inserting outputs
debug: insert-missing-derivations: inserting sources
debug: insert-missing-derivations: ensure-input-derivations-exist
debug: ensure-input-derivations-exist: processing 84 derivations
debug: derivation-file-names->vhash: 84 file-names
debug: derivation-file-names->vhash: lookup 84 file-names, 48 not cached
debug: derivation-file-names->vhash: adding 36 entries to the cache
debug: ensure-input-derivations-exist: checking for missing input derivations
debug: insert-missing-derivations: inserting 12 derivations
debug: insert-missing-derivations: updating hash table
debug: insert-missing-derivations: inserting outputs
debug: insert-missing-derivations: inserting sources
debug: insert-missing-derivations: ensure-input-derivations-exist
debug: ensure-input-derivations-exist: processing 84 derivations
debug: derivation-file-names->vhash: 84 file-names
debug: derivation-file-names->vhash: lookup 84 file-names, 72 not cached
debug: derivation-file-names->vhash: adding 72 entries to the cache
debug: ensure-input-derivations-exist: checking for missing input derivations
debug: insert-missing-derivations: inserting inputs
debug: insert-missing-derivations: inserting inputs
debug: insert-missing-derivations: inserting inputs
debug: insert-missing-derivations: inserting inputs
debug: insert-missing-derivations: inserting inputs
debug: insert-missing-derivations: inserting inputs
debug: derivation-file-names->derivation-ids: processing 6 derivations
debug: derivation-file-names->vhash: 6 file-names
debug: derivation-file-names->vhash: lookup 6 file-names, 6 not cached
debug: derivation-file-names->vhash: adding 0 entries to the cache
debug: insert-missing-derivations: inserting 6 derivations
debug: insert-missing-derivations: updating hash table
debug: insert-missing-derivations: inserting outputs
debug: insert-missing-derivations: inserting sources
debug: insert-missing-derivations: ensure-input-derivations-exist
debug: ensure-input-derivations-exist: processing 144 derivations
debug: derivation-file-names->vhash: 144 file-names
debug: derivation-file-names->vhash: lookup 144 file-names, 144 not cached
debug: derivation-file-names->vhash: adding 138 entries to the cache
debug: ensure-input-derivations-exist: checking for missing input derivations
debug: insert-missing-derivations: inserting 6 derivations
debug: insert-missing-derivations: updating hash table
debug: insert-missing-derivations: inserting outputs
debug: insert-missing-derivations: inserting sources
debug: insert-missing-derivations: ensure-input-derivations-exist
debug: ensure-input-derivations-exist: processing 24 derivations
debug: derivation-file-names->vhash: 24 file-names
debug: derivation-file-names->vhash: lookup 24 file-names, 12 not cached
debug: derivation-file-names->vhash: adding 6 entries to the cache
debug: ensure-input-derivations-exist: checking for missing input derivations
debug: insert-missing-derivations: inserting 6 derivations
debug: insert-missing-derivations: updating hash table
debug: insert-missing-derivations: inserting outputs
debug: insert-missing-derivations: inserting sources
debug: insert-missing-derivations: ensure-input-derivations-exist
debug: ensure-input-derivations-exist: processing 66 derivations
debug: derivation-file-names->vhash: 66 file-names
debug: derivation-file-names->vhash: lookup 66 file-names, 36 not cached
debug: derivation-file-names->vhash: adding 30 entries to the cache
debug: ensure-input-derivations-exist: checking for missing input derivations
debug: insert-missing-derivations: inserting 6 derivations
debug: insert-missing-derivations: updating hash table
debug: insert-missing-derivations: inserting outputs
debug: insert-missing-derivations: inserting sources
debug: insert-missing-derivations: ensure-input-derivations-exist
debug: ensure-input-derivations-exist: processing 18 derivations
debug: derivation-file-names->vhash: 18 file-names
debug: derivation-file-names->vhash: lookup 18 file-names, 12 not cached
debug: derivation-file-names->vhash: adding 0 entries to the cache
debug: ensure-input-derivations-exist: checking for missing input derivations
debug: insert-missing-derivations: inserting 12 derivations
debug: insert-missing-derivations: updating hash table
debug: insert-missing-derivations: inserting outputs
debug: insert-missing-derivations: inserting sources
debug: insert-missing-derivations: ensure-input-derivations-exist
debug: ensure-input-derivations-exist: processing 84 derivations
debug: derivation-file-names->vhash: 84 file-names
debug: derivation-file-names->vhash: lookup 84 file-names, 48 not cached
debug: derivation-file-names->vhash: adding 36 entries to the cache
debug: ensure-input-derivations-exist: checking for missing input derivations
debug: insert-missing-derivations: inserting 12 derivations
debug: insert-missing-derivations: updating hash table
debug: insert-missing-derivations: inserting outputs
debug: insert-missing-derivations: inserting sources
debug: insert-missing-derivations: ensure-input-derivations-exist
debug: ensure-input-derivations-exist: processing 84 derivations
debug: derivation-file-names->vhash: 84 file-names
debug: derivation-file-names->vhash: lookup 84 file-names, 72 not cached
debug: derivation-file-names->vhash: adding 72 entries to the cache
debug: ensure-input-derivations-exist: checking for missing input derivations
debug: insert-missing-derivations: inserting inputs
debug: insert-missing-derivations: inserting inputs
debug: insert-missing-derivations: inserting inputs
debug: insert-missing-derivations: inserting inputs
debug: insert-missing-derivations: inserting inputs
debug: insert-missing-derivations: inserting inputs
debug: derivation-file-names->derivation-ids: processing 6 derivations
debug: derivation-file-names->vhash: 6 file-names
debug: derivation-file-names->vhash: lookup 6 file-names, 6 not cached
debug: derivation-file-names->vhash: adding 0 entries to the cache
debug: insert-missing-derivations: inserting 6 derivations
debug: insert-missing-derivations: updating hash table
debug: insert-missing-derivations: inserting outputs
debug: insert-missing-derivations: inserting sources
debug: insert-missing-derivations: ensure-input-derivations-exist
debug: ensure-input-derivations-exist: processing 144 derivations
debug: derivation-file-names->vhash: 144 file-names
debug: derivation-file-names->vhash: lookup 144 file-names, 144 not cached
debug: derivation-file-names->vhash: adding 138 entries to the cache
debug: ensure-input-derivations-exist: checking for missing input derivations
debug: insert-missing-derivations: inserting 6 derivations
debug: insert-missing-derivations: updating hash table
debug: insert-missing-derivations: inserting outputs
debug: insert-missing-derivations: inserting sources
debug: insert-missing-derivations: ensure-input-derivations-exist
debug: ensure-input-derivations-exist: processing 24 derivations
debug: derivation-file-names->vhash: 24 file-names
debug: derivation-file-names->vhash: lookup 24 file-names, 12 not cached
debug: derivation-file-names->vhash: adding 6 entries to the cache
debug: ensure-input-derivations-exist: checking for missing input derivations
debug: insert-missing-derivations: inserting 6 derivations
debug: insert-missing-derivations: updating hash table
debug: insert-missing-derivations: inserting outputs
debug: insert-missing-derivations: inserting sources
debug: insert-missing-derivations: ensure-input-derivations-exist
debug: ensure-input-derivations-exist: processing 66 derivations
debug: derivation-file-names->vhash: 66 file-names
debug: derivation-file-names->vhash: lookup 66 file-names, 36 not cached
debug: derivation-file-names->vhash: adding 30 entries to the cache
debug: ensure-input-derivations-exist: checking for missing input derivations
debug: insert-missing-derivations: inserting 6 derivations
debug: insert-missing-derivations: updating hash table
debug: insert-missing-derivations: inserting outputs
debug: insert-missing-derivations: inserting sources
debug: insert-missing-derivations: ensure-input-derivations-exist
debug: ensure-input-derivations-exist: processing 18 derivations
debug: derivation-file-names->vhash: 18 file-names
debug: derivation-file-names->vhash: lookup 18 file-names, 12 not cached
debug: derivation-file-names->vhash: adding 0 entries to the cache
debug: ensure-input-derivations-exist: checking for missing input derivations
debug: insert-missing-derivations: inserting 12 derivations
debug: insert-missing-derivations: updating hash table
debug: insert-missing-derivations: inserting outputs
debug: insert-missing-derivations: inserting sources
debug: insert-missing-derivations: ensure-input-derivations-exist
debug: ensure-input-derivations-exist: processing 84 derivations
debug: derivation-file-names->vhash: 84 file-names
debug: derivation-file-names->vhash: lookup 84 file-names, 48 not cached
debug: derivation-file-names->vhash: adding 36 entries to the cache
debug: ensure-input-derivations-exist: checking for missing input derivations
debug: insert-missing-derivations: inserting 12 derivations
debug: insert-missing-derivations: updating hash table
debug: insert-missing-derivations: inserting outputs
debug: insert-missing-derivations: inserting sources
debug: insert-missing-derivations: ensure-input-derivations-exist
debug: ensure-input-derivations-exist: processing 84 derivations
debug: derivation-file-names->vhash: 84 file-names
debug: derivation-file-names->vhash: lookup 84 file-names, 72 not cached
debug: derivation-file-names->vhash: adding 72 entries to the cache
debug: ensure-input-derivations-exist: checking for missing input derivations
debug: insert-missing-derivations: inserting inputs
debug: insert-missing-derivations: inserting inputs
debug: insert-missing-derivations: inserting inputs
debug: insert-missing-derivations: inserting inputs
debug: insert-missing-derivations: inserting inputs
debug: insert-missing-derivations: inserting inputs
debug: derivation-file-names->derivation-ids: processing 6 derivations
debug: derivation-file-names->vhash: 6 file-names
debug: derivation-file-names->vhash: lookup 6 file-names, 6 not cached
debug: derivation-file-names->vhash: adding 0 entries to the cache
debug: insert-missing-derivations: inserting 6 derivations
debug: insert-missing-derivations: updating hash table
debug: insert-missing-derivations: inserting outputs
debug: insert-missing-derivations: inserting sources
debug: insert-missing-derivations: ensure-input-derivations-exist
debug: ensure-input-derivations-exist: processing 144 derivations
debug: derivation-file-names->vhash: 144 file-names
debug: derivation-file-names->vhash: lookup 144 file-names, 144 not cached
debug: derivation-file-names->vhash: adding 138 entries to the cache
debug: ensure-input-derivations-exist: checking for missing input derivations
debug: insert-missing-derivations: inserting 6 derivations
debug: insert-missing-derivations: updating hash table
debug: insert-missing-derivations: inserting outputs
debug: insert-missing-derivations: inserting sources
debug: insert-missing-derivations: ensure-input-derivations-exist
debug: ensure-input-derivations-exist: processing 24 derivations
debug: derivation-file-names->vhash: 24 file-names
debug: derivation-file-names->vhash: lookup 24 file-names, 12 not cached
debug: derivation-file-names->vhash: adding 6 entries to the cache
debug: ensure-input-derivations-exist: checking for missing input derivations
debug: insert-missing-derivations: inserting 6 derivations
debug: insert-missing-derivations: updating hash table
debug: insert-missing-derivations: inserting outputs
debug: insert-missing-derivations: inserting sources
debug: insert-missing-derivations: ensure-input-derivations-exist
debug: ensure-input-derivations-exist: processing 66 derivations
debug: derivation-file-names->vhash: 66 file-names
debug: derivation-file-names->vhash: lookup 66 file-names, 36 not cached
debug: derivation-file-names->vhash: adding 30 entries to the cache
debug: ensure-input-derivations-exist: checking for missing input derivations
debug: insert-missing-derivations: inserting 6 derivations
debug: insert-missing-derivations: updating hash table
debug: insert-missing-derivations: inserting outputs
debug: insert-missing-derivations: inserting sources
debug: insert-missing-derivations: ensure-input-derivations-exist
debug: ensure-input-derivations-exist: processing 18 derivations
debug: derivation-file-names->vhash: 18 file-names
debug: derivation-file-names->vhash: lookup 18 file-names, 12 not cached
debug: derivation-file-names->vhash: adding 0 entries to the cache
debug: ensure-input-derivations-exist: checking for missing input derivations
debug: insert-missing-derivations: inserting 12 derivations
debug: insert-missing-derivations: updating hash table
debug: insert-missing-derivations: inserting outputs
debug: insert-missing-derivations: inserting sources
debug: insert-missing-derivations: ensure-input-derivations-exist
debug: ensure-input-derivations-exist: processing 84 derivations
debug: derivation-file-names->vhash: 84 file-names
debug: derivation-file-names->vhash: lookup 84 file-names, 48 not cached
debug: derivation-file-names->vhash: adding 36 entries to the cache
debug: ensure-input-derivations-exist: checking for missing input derivations
debug: insert-missing-derivations: inserting 12 derivations
debug: insert-missing-derivations: updating hash table
debug: insert-missing-derivations: inserting outputs
debug: insert-missing-derivations: inserting sources
debug: insert-missing-derivations: ensure-input-derivations-exist
debug: ensure-input-derivations-exist: processing 84 derivations
debug: derivation-file-names->vhash: 84 file-names
debug: derivation-file-names->vhash: lookup 84 file-names, 72 not cached
debug: derivation-file-names->vhash: adding 72 entries to the cache
debug: ensure-input-derivations-exist: checking for missing input derivations
debug: insert-missing-derivations: inserting inputs
debug: insert-missing-derivations: inserting inputs
debug: insert-missing-derivations: inserting inputs
debug: insert-missing-derivations: inserting inputs
debug: insert-missing-derivations: inserting inputs
debug: insert-missing-derivations: inserting inputs
debug: derivation-file-names->derivation-ids: processing 6 derivations
debug: derivation-file-names->vhash: 6 file-names
debug: derivation-file-names->vhash: lookup 6 file-names, 6 not cached
debug: derivation-file-names->vhash: adding 0 entries to the cache
debug: insert-missing-derivations: inserting 6 derivations
debug: insert-missing-derivations: updating hash table
debug: insert-missing-derivations: inserting outputs
debug: insert-missing-derivations: inserting sources
debug: insert-missing-derivations: ensure-input-derivations-exist
debug: ensure-input-derivations-exist: processing 144 derivations
debug: derivation-file-names->vhash: 144 file-names
debug: derivation-file-names->vhash: lookup 144 file-names, 144 not cached
debug: derivation-file-names->vhash: adding 138 entries to the cache
debug: ensure-input-derivations-exist: checking for missing input derivations
debug: insert-missing-derivations: inserting 6 derivations
debug: insert-missing-derivations: updating hash table
debug: insert-missing-derivations: inserting outputs
debug: insert-missing-derivations: inserting sources
debug: insert-missing-derivations: ensure-input-derivations-exist
debug: ensure-input-derivations-exist: processing 24 derivations
debug: derivation-file-names->vhash: 24 file-names
debug: derivation-file-names->vhash: lookup 24 file-names, 12 not cached
debug: derivation-file-names->vhash: adding 6 entries to the cache
debug: ensure-input-derivations-exist: checking for missing input derivations
debug: insert-missing-derivations: inserting 6 derivations
debug: insert-missing-derivations: updating hash table
debug: insert-missing-derivations: inserting outputs
debug: insert-missing-derivations: inserting sources
debug: insert-missing-derivations: ensure-input-derivations-exist
debug: ensure-input-derivations-exist: processing 66 derivations
debug: derivation-file-names->vhash: 66 file-names
debug: derivation-file-names->vhash: lookup 66 file-names, 36 not cached
debug: derivation-file-names->vhash: adding 30 entries to the cache
debug: ensure-input-derivations-exist: checking for missing input derivations
debug: insert-missing-derivations: inserting 6 derivations
debug: insert-missing-derivations: updating hash table
debug: insert-missing-derivations: inserting outputs
debug: insert-missing-derivations: inserting sources
debug: insert-missing-derivations: ensure-input-derivations-exist
debug: ensure-input-derivations-exist: processing 18 derivations
debug: derivation-file-names->vhash: 18 file-names
debug: derivation-file-names->vhash: lookup 18 file-names, 12 not cached
debug: derivation-file-names->vhash: adding 0 entries to the cache
debug: ensure-input-derivations-exist: checking for missing input derivations
debug: insert-missing-derivations: inserting 12 derivations
debug: insert-missing-derivations: updating hash table
debug: insert-missing-derivations: inserting outputs
debug: insert-missing-derivations: inserting sources
debug: insert-missing-derivations: ensure-input-derivations-exist
debug: ensure-input-derivations-exist: processing 84 derivations
debug: derivation-file-names->vhash: 84 file-names
debug: derivation-file-names->vhash: lookup 84 file-names, 48 not cached
debug: derivation-file-names->vhash: adding 36 entries to the cache
debug: ensure-input-derivations-exist: checking for missing input derivations
debug: insert-missing-derivations: inserting 12 derivations
debug: insert-missing-derivations: updating hash table
debug: insert-missing-derivations: inserting outputs
debug: insert-missing-derivations: inserting sources
debug: insert-missing-derivations: ensure-input-derivations-exist
debug: ensure-input-derivations-exist: processing 84 derivations
debug: derivation-file-names->vhash: 84 file-names
debug: derivation-file-names->vhash: lookup 84 file-names, 72 not cached
debug: derivation-file-names->vhash: adding 72 entries to the cache
debug: ensure-input-derivations-exist: checking for missing input derivations
debug: insert-missing-derivations: inserting inputs
debug: insert-missing-derivations: inserting inputs
debug: insert-missing-derivations: inserting inputs
debug: insert-missing-derivations: inserting inputs
debug: insert-missing-derivations: inserting inputs
debug: insert-missing-derivations: inserting inputs
debug: derivation-file-names->derivation-ids: processing 6 derivations
debug: derivation-file-names->vhash: 6 file-names
debug: derivation-file-names->vhash: lookup 6 file-names, 6 not cached
debug: derivation-file-names->vhash: adding 0 entries to the cache
debug: insert-missing-derivations: inserting 6 derivations
debug: insert-missing-derivations: updating hash table
debug: insert-missing-derivations: inserting outputs
debug: insert-missing-derivations: inserting sources
debug: insert-missing-derivations: ensure-input-derivations-exist
debug: ensure-input-derivations-exist: processing 144 derivations
debug: derivation-file-names->vhash: 144 file-names
debug: derivation-file-names->vhash: lookup 144 file-names, 144 not cached
debug: derivation-file-names->vhash: adding 138 entries to the cache
debug: ensure-input-derivations-exist: checking for missing input derivations
debug: insert-missing-derivations: inserting 6 derivations
debug: insert-missing-derivations: updating hash table
debug: insert-missing-derivations: inserting outputs
debug: insert-missing-derivations: inserting sources
debug: insert-missing-derivations: ensure-input-derivations-exist
debug: ensure-input-derivations-exist: processing 24 derivations
debug: derivation-file-names->vhash: 24 file-names
debug: derivation-file-names->vhash: lookup 24 file-names, 12 not cached
debug: derivation-file-names->vhash: adding 6 entries to the cache
debug: ensure-input-derivations-exist: checking for missing input derivations
debug: insert-missing-derivations: inserting 6 derivations
debug: insert-missing-derivations: updating hash table
debug: insert-missing-derivations: inserting outputs
debug: insert-missing-derivations: inserting sources
debug: insert-missing-derivations: ensure-input-derivations-exist
debug: ensure-input-derivations-exist: processing 66 derivations
debug: derivation-file-names->vhash: 66 file-names
debug: derivation-file-names->vhash: lookup 66 file-names, 36 not cached
debug: derivation-file-names->vhash: adding 30 entries to the cache
debug: ensure-input-derivations-exist: checking for missing input derivations
debug: insert-missing-derivations: inserting 6 derivations
debug: insert-missing-derivations: updating hash table
debug: insert-missing-derivations: inserting outputs
debug: insert-missing-derivations: inserting sources
debug: insert-missing-derivations: ensure-input-derivations-exist
debug: ensure-input-derivations-exist: processing 18 derivations
debug: derivation-file-names->vhash: 18 file-names
debug: derivation-file-names->vhash: lookup 18 file-names, 12 not cached
debug: derivation-file-names->vhash: adding 0 entries to the cache
debug: ensure-input-derivations-exist: checking for missing input derivations
debug: insert-missing-derivations: inserting 12 derivations
debug: insert-missing-derivations: updating hash table
debug: insert-missing-derivations: inserting outputs
debug: insert-missing-derivations: inserting sources
debug: insert-missing-derivations: ensure-input-derivations-exist
debug: ensure-input-derivations-exist: processing 84 derivations
debug: derivation-file-names->vhash: 84 file-names
debug: derivation-file-names->vhash: lookup 84 file-names, 48 not cached
debug: derivation-file-names->vhash: adding 36 entries to the cache
debug: ensure-input-derivations-exist: checking for missing input derivations
debug: insert-missing-derivations: inserting 12 derivations
debug: insert-missing-derivations: updating hash table
debug: insert-missing-derivations: inserting outputs
debug: insert-missing-derivations: inserting sources
debug: insert-missing-derivations: ensure-input-derivations-exist
debug: ensure-input-derivations-exist: processing 84 derivations
debug: derivation-file-names->vhash: 84 file-names
debug: derivation-file-names->vhash: lookup 84 file-names, 72 not cached
debug: derivation-file-names->vhash: adding 72 entries to the cache
debug: ensure-input-derivations-exist: checking for missing input derivations
debug: insert-missing-derivations: inserting inputs
debug: insert-missing-derivations: inserting inputs
debug: insert-missing-derivations: inserting inputs
debug: insert-missing-derivations: inserting inputs
debug: insert-missing-derivations: inserting inputs
debug: insert-missing-derivations: inserting inputs
debug: derivation-file-names->derivation-ids: processing 6 derivations
debug: derivation-file-names->vhash: 6 file-names
debug: derivation-file-names->vhash: lookup 6 file-names, 6 not cached
debug: derivation-file-names->vhash: adding 0 entries to the cache
debug: insert-missing-derivations: inserting 6 derivations
debug: insert-missing-derivations: updating hash table
debug: insert-missing-derivations: inserting outputs
debug: insert-missing-derivations: inserting sources
debug: insert-missing-derivations: ensure-input-derivations-exist
debug: ensure-input-derivations-exist: processing 144 derivations
debug: derivation-file-names->vhash: 144 file-names
debug: derivation-file-names->vhash: lookup 144 file-names, 144 not cached
debug: derivation-file-names->vhash: adding 138 entries to the cache
debug: ensure-input-derivations-exist: checking for missing input derivations
debug: insert-missing-derivations: inserting 6 derivations
debug: insert-missing-derivations: updating hash table
debug: insert-missing-derivations: inserting outputs
debug: insert-missing-derivations: inserting sources
debug: insert-missing-derivations: ensure-input-derivations-exist
debug: ensure-input-derivations-exist: processing 24 derivations
debug: derivation-file-names->vhash: 24 file-names
debug: derivation-file-names->vhash: lookup 24 file-names, 12 not cached
debug: derivation-file-names->vhash: adding 6 entries to the cache
debug: ensure-input-derivations-exist: checking for missing input derivations
debug: insert-missing-derivations: inserting 6 derivations
debug: insert-missing-derivations: updating hash table
debug: insert-missing-derivations: inserting outputs
debug: insert-missing-derivations: inserting sources
debug: insert-missing-derivations: ensure-input-derivations-exist
debug: ensure-input-derivations-exist: processing 66 derivations
debug: derivation-file-names->vhash: 66 file-names
debug: derivation-file-names->vhash: lookup 66 file-names, 36 not cached
debug: derivation-file-names->vhash: adding 30 entries to the cache
debug: ensure-input-derivations-exist: checking for missing input derivations
debug: insert-missing-derivations: inserting 6 derivations
debug: insert-missing-derivations: updating hash table
debug: insert-missing-derivations: inserting outputs
debug: insert-missing-derivations: inserting sources
debug: insert-missing-derivations: ensure-input-derivations-exist
debug: ensure-input-derivations-exist: processing 18 derivations
debug: derivation-file-names->vhash: 18 file-names
debug: derivation-file-names->vhash: lookup 18 file-names, 12 not cached
debug: derivation-file-names->vhash: adding 0 entries to the cache
debug: ensure-input-derivations-exist: checking for missing input derivations
debug: insert-missing-derivations: inserting 12 derivations
debug: insert-missing-derivations: updating hash table
debug: insert-missing-derivations: inserting outputs
debug: insert-missing-derivations: inserting sources
debug: insert-missing-derivations: ensure-input-derivations-exist
debug: ensure-input-derivations-exist: processing 84 derivations
debug: derivation-file-names->vhash: 84 file-names
debug: derivation-file-names->vhash: lookup 84 file-names, 48 not cached
debug: derivation-file-names->vhash: adding 36 entries to the cache
debug: ensure-input-derivations-exist: checking for missing input derivations
debug: insert-missing-derivations: inserting 12 derivations
debug: insert-missing-derivations: updating hash table
debug: insert-missing-derivations: inserting outputs
debug: insert-missing-derivations: inserting sources
debug: insert-missing-derivations: ensure-input-derivations-exist
debug: ensure-input-derivations-exist: processing 84 derivations
debug: derivation-file-names->vhash: 84 file-names
debug: derivation-file-names->vhash: lookup 84 file-names, 72 not cached
debug: derivation-file-names->vhash: adding 72 entries to the cache
debug: ensure-input-derivations-exist: checking for missing input derivations
debug: insert-missing-derivations: inserting inputs
debug: insert-missing-derivations: inserting inputs
debug: insert-missing-derivations: inserting inputs
debug: insert-missing-derivations: inserting inputs
debug: insert-missing-derivations: inserting inputs
debug: insert-missing-derivations: inserting inputs
debug: derivation-file-names->derivation-ids: processing 6 derivations
debug: derivation-file-names->vhash: 6 file-names
debug: derivation-file-names->vhash: lookup 6 file-names, 6 not cached
debug: derivation-file-names->vhash: adding 0 entries to the cache
debug: insert-missing-derivations: inserting 6 derivations
debug: insert-missing-derivations: updating hash table
debug: insert-missing-derivations: inserting outputs
debug: insert-missing-derivations: inserting sources
debug: insert-missing-derivations: ensure-input-derivations-exist
debug: ensure-input-derivations-exist: processing 144 derivations
debug: derivation-file-names->vhash: 144 file-names
debug: derivation-file-names->vhash: lookup 144 file-names, 144 not cached
debug: derivation-file-names->vhash: adding 138 entries to the cache
debug: ensure-input-derivations-exist: checking for missing input derivations
debug: insert-missing-derivations: inserting 6 derivations
debug: insert-missing-derivations: updating hash table
debug: insert-missing-derivations: inserting outputs
debug: insert-missing-derivations: inserting sources
debug: insert-missing-derivations: ensure-input-derivations-exist
debug: ensure-input-derivations-exist: processing 30 derivations
debug: derivation-file-names->vhash: 30 file-names
debug: derivation-file-names->vhash: lookup 30 file-names, 18 not cached
debug: derivation-file-names->vhash: adding 12 entries to the cache
debug: ensure-input-derivations-exist: checking for missing input derivations
debug: insert-missing-derivations: inserting 6 derivations
debug: insert-missing-derivations: updating hash table
debug: insert-missing-derivations: inserting outputs
debug: insert-missing-derivations: inserting sources
debug: insert-missing-derivations: ensure-input-derivations-exist
debug: ensure-input-derivations-exist: processing 108 derivations
debug: derivation-file-names->vhash: 108 file-names
debug: derivation-file-names->vhash: lookup 108 file-names, 84 not cached
debug: derivation-file-names->vhash: adding 72 entries to the cache
debug: ensure-input-derivations-exist: checking for missing input derivations
debug: insert-missing-derivations: inserting 12 derivations
debug: insert-missing-derivations: updating hash table
debug: insert-missing-derivations: inserting outputs
debug: insert-missing-derivations: inserting sources
debug: insert-missing-derivations: ensure-input-derivations-exist
debug: ensure-input-derivations-exist: processing 84 derivations
debug: derivation-file-names->vhash: 84 file-names
debug: derivation-file-names->vhash: lookup 84 file-names, 72 not cached
debug: derivation-file-names->vhash: adding 72 entries to the cache
debug: ensure-input-derivations-exist: checking for missing input derivations
debug: insert-missing-derivations: inserting inputs
debug: insert-missing-derivations: inserting inputs
debug: insert-missing-derivations: inserting inputs
debug: insert-missing-derivations: inserting inputs
debug: derivation-file-names->derivation-ids: processing 6 derivations
debug: derivation-file-names->vhash: 6 file-names
debug: derivation-file-names->vhash: lookup 6 file-names, 6 not cached
debug: derivation-file-names->vhash: adding 0 entries to the cache
debug: insert-missing-derivations: inserting 6 derivations
debug: insert-missing-derivations: updating hash table
debug: insert-missing-derivations: inserting outputs
debug: insert-missing-derivations: inserting sources
debug: insert-missing-derivations: ensure-input-derivations-exist
debug: ensure-input-derivations-exist: processing 144 derivations
debug: derivation-file-names->vhash: 144 file-names
debug: derivation-file-names->vhash: lookup 144 file-names, 144 not cached
debug: derivation-file-names->vhash: adding 138 entries to the cache
debug: ensure-input-derivations-exist: checking for missing input derivations
debug: insert-missing-derivations: inserting 6 derivations
debug: insert-missing-derivations: updating hash table
debug: insert-missing-derivations: inserting outputs
debug: insert-missing-derivations: inserting sources
debug: insert-missing-derivations: ensure-input-derivations-exist
debug: ensure-input-derivations-exist: processing 30 derivations
debug: derivation-file-names->vhash: 30 file-names
debug: derivation-file-names->vhash: lookup 30 file-names, 18 not cached
debug: derivation-file-names->vhash: adding 12 entries to the cache
debug: ensure-input-derivations-exist: checking for missing input derivations
debug: insert-missing-derivations: inserting 6 derivations
debug: insert-missing-derivations: updating hash table
debug: insert-missing-derivations: inserting outputs
debug: insert-missing-derivations: inserting sources
debug: insert-missing-derivations: ensure-input-derivations-exist
debug: ensure-input-derivations-exist: processing 108 derivations
debug: derivation-file-names->vhash: 108 file-names
debug: derivation-file-names->vhash: lookup 108 file-names, 84 not cached
debug: derivation-file-names->vhash: adding 72 entries to the cache
debug: ensure-input-derivations-exist: checking for missing input derivations
debug: insert-missing-derivations: inserting 12 derivations
debug: insert-missing-derivations: updating hash table
debug: insert-missing-derivations: inserting outputs
debug: insert-missing-derivations: inserting sources
debug: insert-missing-derivations: ensure-input-derivations-exist
debug: ensure-input-derivations-exist: processing 84 derivations
debug: derivation-file-names->vhash: 84 file-names
debug: derivation-file-names->vhash: lookup 84 file-names, 72 not cached
debug: derivation-file-names->vhash: adding 72 entries to the cache
debug: ensure-input-derivations-exist: checking for missing input derivations
debug: insert-missing-derivations: inserting inputs
debug: insert-missing-derivations: inserting inputs
debug: insert-missing-derivations: inserting inputs
debug: insert-missing-derivations: inserting inputs
debug: derivation-file-names->derivation-ids: processing 6 derivations
debug: derivation-file-names->vhash: 6 file-names
debug: derivation-file-names->vhash: lookup 6 file-names, 6 not cached
debug: derivation-file-names->vhash: adding 0 entries to the cache
debug: insert-missing-derivations: inserting 6 derivations
debug: insert-missing-derivations: updating hash table
debug: insert-missing-derivations: inserting outputs
debug: insert-missing-derivations: inserting sources
debug: insert-missing-derivations: ensure-input-derivations-exist
debug: ensure-input-derivations-exist: processing 144 derivations
debug: derivation-file-names->vhash: 144 file-names
debug: derivation-file-names->vhash: lookup 144 file-names, 144 not cached
debug: derivation-file-names->vhash: adding 138 entries to the cache
debug: ensure-input-derivations-exist: checking for missing input derivations
debug: insert-missing-derivations: inserting 6 derivations
debug: insert-missing-derivations: updating hash table
debug: insert-missing-derivations: inserting outputs
debug: insert-missing-derivations: inserting sources
debug: insert-missing-derivations: ensure-input-derivations-exist
debug: ensure-input-derivations-exist: processing 24 derivations
debug: derivation-file-names->vhash: 24 file-names
debug: derivation-file-names->vhash: lookup 24 file-names, 12 not cached
debug: derivation-file-names->vhash: adding 6 entries to the cache
debug: ensure-input-derivations-exist: checking for missing input derivations
debug: insert-missing-derivations: inserting 6 derivations
debug: insert-missing-derivations: updating hash table
debug: insert-missing-derivations: inserting outputs
debug: insert-missing-derivations: inserting sources
debug: insert-missing-derivations: ensure-input-derivations-exist
debug: ensure-input-derivations-exist: processing 66 derivations
debug: derivation-file-names->vhash: 66 file-names
debug: derivation-file-names->vhash: lookup 66 file-names, 36 not cached
debug: derivation-file-names->vhash: adding 30 entries to the cache
debug: ensure-input-derivations-exist: checking for missing input derivations
debug: insert-missing-derivations: inserting 6 derivations
debug: insert-missing-derivations: updating hash table
debug: insert-missing-derivations: inserting outputs
debug: insert-missing-derivations: inserting sources
debug: insert-missing-derivations: ensure-input-derivations-exist
debug: ensure-input-derivations-exist: processing 18 derivations
debug: derivation-file-names->vhash: 18 file-names
debug: derivation-file-names->vhash: lookup 18 file-names, 12 not cached
debug: derivation-file-names->vhash: adding 0 entries to the cache
debug: ensure-input-derivations-exist: checking for missing input derivations
debug: insert-missing-derivations: inserting 12 derivations
debug: insert-missing-derivations: updating hash table
debug: insert-missing-derivations: inserting outputs
debug: insert-missing-derivations: inserting sources
debug: insert-missing-derivations: ensure-input-derivations-exist
debug: ensure-input-derivations-exist: processing 84 derivations
debug: derivation-file-names->vhash: 84 file-names
debug: derivation-file-names->vhash: lookup 84 file-names, 48 not cached
debug: derivation-file-names->vhash: adding 36 entries to the cache
debug: ensure-input-derivations-exist: checking for missing input derivations
debug: insert-missing-derivations: inserting 12 derivations
debug: insert-missing-derivations: updating hash table
debug: insert-missing-derivations: inserting outputs
debug: insert-missing-derivations: inserting sources
debug: insert-missing-derivations: ensure-input-derivations-exist
debug: ensure-input-derivations-exist: processing 84 derivations
debug: derivation-file-names->vhash: 84 file-names
debug: derivation-file-names->vhash: lookup 84 file-names, 72 not cached
debug: derivation-file-names->vhash: adding 72 entries to the cache
debug: ensure-input-derivations-exist: checking for missing input derivations
debug: insert-missing-derivations: inserting inputs
debug: insert-missing-derivations: inserting inputs
debug: insert-missing-derivations: inserting inputs
debug: insert-missing-derivations: inserting inputs
debug: insert-missing-derivations: inserting inputs
debug: insert-missing-derivations: inserting inputs
debug: derivation-file-names->derivation-ids: processing 6 derivations
debug: derivation-file-names->vhash: 6 file-names
debug: derivation-file-names->vhash: lookup 6 file-names, 6 not cached
debug: derivation-file-names->vhash: adding 6 entries to the cache
debug: derivation-file-names->derivation-ids: processing 6 derivations
debug: derivation-file-names->vhash: 6 file-names
debug: derivation-file-names->vhash: lookup 6 file-names, 6 not cached
debug: derivation-file-names->vhash: adding 6 entries to the cache
debug: derivation-file-names->derivation-ids: processing 6 derivations
debug: derivation-file-names->vhash: 6 file-names
debug: derivation-file-names->vhash: lookup 6 file-names, 6 not cached
debug: derivation-file-names->vhash: adding 6 entries to the cache
debug: derivation-file-names->derivation-ids: processing 6 derivations
debug: derivation-file-names->vhash: 6 file-names
debug: derivation-file-names->vhash: lookup 6 file-names, 6 not cached
debug: derivation-file-names->vhash: adding 6 entries to the cache
debug: derivation-file-names->derivation-ids: processing 6 derivations
debug: derivation-file-names->vhash: 6 file-names
debug: derivation-file-names->vhash: lookup 6 file-names, 6 not cached
debug: derivation-file-names->vhash: adding 6 entries to the cache
debug: derivation-file-names->derivation-ids: processing 6 derivations
debug: derivation-file-names->vhash: 6 file-names
debug: derivation-file-names->vhash: lookup 6 file-names, 6 not cached
debug: derivation-file-names->vhash: adding 6 entries to the cache
debug: derivation-file-names->derivation-ids: processing 6 derivations
debug: derivation-file-names->vhash: 6 file-names
debug: derivation-file-names->vhash: lookup 6 file-names, 6 not cached
debug: derivation-file-names->vhash: adding 6 entries to the cache
debug: derivation-file-names->derivation-ids: processing 6 derivations
debug: derivation-file-names->vhash: 6 file-names
debug: derivation-file-names->vhash: lookup 6 file-names, 6 not cached
debug: derivation-file-names->vhash: adding 6 entries to the cache
debug: derivation-file-names->derivation-ids: processing 6 derivations
debug: derivation-file-names->vhash: 6 file-names
debug: derivation-file-names->vhash: lookup 6 file-names, 6 not cached
debug: derivation-file-names->vhash: adding 6 entries to the cache
debug: derivation-file-names->derivation-ids: processing 6 derivations
debug: derivation-file-names->vhash: 6 file-names
debug: derivation-file-names->vhash: lookup 6 file-names, 6 not cached
debug: derivation-file-names->vhash: adding 6 entries to the cache
debug: derivation-file-names->derivation-ids: processing 6 derivations
debug: derivation-file-names->vhash: 6 file-names
debug: derivation-file-names->vhash: lookup 6 file-names, 6 not cached
debug: derivation-file-names->vhash: adding 6 entries to the cache
debug: derivation-file-names->derivation-ids: processing 6 derivations
debug: derivation-file-names->vhash: 6 file-names
debug: derivation-file-names->vhash: lookup 6 file-names, 6 not cached
debug: derivation-file-names->vhash: adding 6 entries to the cache
debug: derivation-file-names->derivation-ids: processing 6 derivations
debug: derivation-file-names->vhash: 6 file-names
debug: derivation-file-names->vhash: lookup 6 file-names, 6 not cached
debug: derivation-file-names->vhash: adding 6 entries to the cache
debug: derivation-file-names->derivation-ids: processing 6 derivations
debug: derivation-file-names->vhash: 6 file-names
debug: derivation-file-names->vhash: lookup 6 file-names, 6 not cached
debug: derivation-file-names->vhash: adding 6 entries to the cache
debug: derivation-file-names->derivation-ids: processing 6 derivations
debug: derivation-file-names->vhash: 6 file-names
debug: derivation-file-names->vhash: lookup 6 file-names, 6 not cached
debug: derivation-file-names->vhash: adding 6 entries to the cache
debug: derivation-file-names->derivation-ids: processing 6 derivations
debug: derivation-file-names->vhash: 6 file-names
debug: derivation-file-names->vhash: lookup 6 file-names, 6 not cached
debug: derivation-file-names->vhash: adding 6 entries to the cache
debug: derivation-file-names->derivation-ids: processing 6 derivations
debug: derivation-file-names->vhash: 6 file-names
debug: derivation-file-names->vhash: lookup 6 file-names, 6 not cached
debug: derivation-file-names->vhash: adding 6 entries to the cache
debug: derivation-file-names->derivation-ids: processing 6 derivations
debug: derivation-file-names->vhash: 6 file-names
debug: derivation-file-names->vhash: lookup 6 file-names, 6 not cached
debug: derivation-file-names->vhash: adding 6 entries to the cache
debug: derivation-file-names->derivation-ids: processing 6 derivations
debug: derivation-file-names->vhash: 6 file-names
debug: derivation-file-names->vhash: lookup 6 file-names, 6 not cached
debug: derivation-file-names->vhash: adding 6 entries to the cache
debug: derivation-file-names->derivation-ids: processing 6 derivations
debug: derivation-file-names->vhash: 6 file-names
debug: derivation-file-names->vhash: lookup 6 file-names, 6 not cached
debug: derivation-file-names->vhash: adding 6 entries to the cache
debug: derivation-file-names->derivation-ids: processing 6 derivations
debug: derivation-file-names->vhash: 6 file-names
debug: derivation-file-names->vhash: lookup 6 file-names, 6 not cached
debug: derivation-file-names->vhash: adding 6 entries to the cache
debug: derivation-file-names->derivation-ids: processing 6 derivations
debug: derivation-file-names->vhash: 6 file-names
debug: derivation-file-names->vhash: lookup 6 file-names, 6 not cached
debug: derivation-file-names->vhash: adding 6 entries to the cache
debug: derivation-file-names->derivation-ids: processing 6 derivations
debug: derivation-file-names->vhash: 6 file-names
debug: derivation-file-names->vhash: lookup 6 file-names, 6 not cached
debug: derivation-file-names->vhash: adding 6 entries to the cache
debug: derivation-file-names->derivation-ids: processing 6 derivations
debug: derivation-file-names->vhash: 6 file-names
debug: derivation-file-names->vhash: lookup 6 file-names, 6 not cached
debug: derivation-file-names->vhash: adding 6 entries to the cache
debug: derivation-file-names->derivation-ids: processing 6 derivations
debug: derivation-file-names->vhash: 6 file-names
debug: derivation-file-names->vhash: lookup 6 file-names, 6 not cached
debug: derivation-file-names->vhash: adding 6 entries to the cache
debug: derivation-file-names->derivation-ids: processing 6 derivations
debug: derivation-file-names->vhash: 6 file-names
debug: derivation-file-names->vhash: lookup 6 file-names, 6 not cached
debug: derivation-file-names->vhash: adding 6 entries to the cache
debug: derivation-file-names->derivation-ids: processing 6 derivations
debug: derivation-file-names->vhash: 6 file-names
debug: derivation-file-names->vhash: lookup 6 file-names, 6 not cached
debug: derivation-file-names->vhash: adding 6 entries to the cache
debug: derivation-file-names->derivation-ids: processing 6 derivations
debug: derivation-file-names->vhash: 6 file-names
debug: derivation-file-names->vhash: lookup 6 file-names, 6 not cached
debug: derivation-file-names->vhash: adding 6 entries to the cache
debug: derivation-file-names->derivation-ids: processing 6 derivations
debug: derivation-file-names->vhash: 6 file-names
debug: derivation-file-names->vhash: lookup 6 file-names, 6 not cached
debug: derivation-file-names->vhash: adding 6 entries to the cache
debug: derivation-file-names->derivation-ids: processing 6 derivations
debug: derivation-file-names->vhash: 6 file-names
debug: derivation-file-names->vhash: lookup 6 file-names, 6 not cached
debug: derivation-file-names->vhash: adding 6 entries to the cache
debug: derivation-file-names->derivation-ids: processing 6 derivations
debug: derivation-file-names->vhash: 6 file-names
debug: derivation-file-names->vhash: lookup 6 file-names, 6 not cached
debug: derivation-file-names->vhash: adding 6 entries to the cache
debug: derivation-file-names->derivation-ids: processing 6 derivations
debug: derivation-file-names->vhash: 6 file-names
debug: derivation-file-names->vhash: lookup 6 file-names, 6 not cached
debug: derivation-file-names->vhash: adding 6 entries to the cache
debug: derivation-file-names->derivation-ids: processing 6 derivations
debug: derivation-file-names->vhash: 6 file-names
debug: derivation-file-names->vhash: lookup 6 file-names, 6 not cached
debug: derivation-file-names->vhash: adding 6 entries to the cache
debug: derivation-file-names->derivation-ids: processing 6 derivations
debug: derivation-file-names->vhash: 6 file-names
debug: derivation-file-names->vhash: lookup 6 file-names, 6 not cached
debug: derivation-file-names->vhash: adding 6 entries to the cache
debug: derivation-file-names->derivation-ids: processing 6 derivations
debug: derivation-file-names->vhash: 6 file-names
debug: derivation-file-names->vhash: lookup 6 file-names, 6 not cached
debug: derivation-file-names->vhash: adding 6 entries to the cache
debug: derivation-file-names->derivation-ids: processing 6 derivations
debug: derivation-file-names->vhash: 6 file-names
debug: derivation-file-names->vhash: lookup 6 file-names, 6 not cached
debug: derivation-file-names->vhash: adding 6 entries to the cache
debug: derivation-file-names->derivation-ids: processing 6 derivations
debug: derivation-file-names->vhash: 6 file-names
debug: derivation-file-names->vhash: lookup 6 file-names, 6 not cached
debug: derivation-file-names->vhash: adding 6 entries to the cache
debug: derivation-file-names->derivation-ids: processing 6 derivations
debug: derivation-file-names->vhash: 6 file-names
debug: derivation-file-names->vhash: lookup 6 file-names, 6 not cached
debug: derivation-file-names->vhash: adding 6 entries to the cache
debug: derivation-file-names->derivation-ids: processing 6 derivations
debug: derivation-file-names->vhash: 6 file-names
debug: derivation-file-names->vhash: lookup 6 file-names, 6 not cached
debug: derivation-file-names->vhash: adding 6 entries to the cache
debug: derivation-file-names->derivation-ids: processing 6 derivations
debug: derivation-file-names->vhash: 6 file-names
debug: derivation-file-names->vhash: lookup 6 file-names, 6 not cached
debug: derivation-file-names->vhash: adding 6 entries to the cache
debug: derivation-file-names->derivation-ids: processing 6 derivations
debug: derivation-file-names->vhash: 6 file-names
debug: derivation-file-names->vhash: lookup 6 file-names, 6 not cached
debug: derivation-file-names->vhash: adding 6 entries to the cache
debug: derivation-file-names->derivation-ids: processing 6 derivations
debug: derivation-file-names->vhash: 6 file-names
debug: derivation-file-names->vhash: lookup 6 file-names, 6 not cached
debug: derivation-file-names->vhash: adding 6 entries to the cache
debug: Starting inferior-data->package-derivation-ids
debug: derivation-file-names->derivation-ids: processing 107591 derivations
debug: derivation-file-names->vhash: 107591 file-names
debug: derivation-file-names->vhash: lookup 107591 file-names, 107591 not cached
debug: derivation-file-names->vhash: adding 106662 entries to the cache
debug: insert-missing-derivations: inserting 72 derivations
debug: insert-missing-derivations: updating hash table
debug: insert-missing-derivations: inserting outputs
debug: insert-missing-derivations: inserting sources
debug: insert-missing-derivations: ensure-input-derivations-exist
debug: ensure-input-derivations-exist: processing 2592 derivations
debug: derivation-file-names->vhash: 2592 file-names
debug: derivation-file-names->vhash: lookup 2592 file-names, 222 not cached
debug: derivation-file-names->vhash: adding 204 entries to the cache
debug: ensure-input-derivations-exist: checking for missing input derivations
debug: insert-missing-derivations: inserting 18 derivations
debug: insert-missing-derivations: updating hash table
debug: insert-missing-derivations: inserting outputs
debug: insert-missing-derivations: inserting sources
debug: insert-missing-derivations: ensure-input-derivations-exist
debug: ensure-input-derivations-exist: processing 150 derivations
debug: derivation-file-names->vhash: 150 file-names
debug: derivation-file-names->vhash: lookup 150 file-names, 6 not cached
debug: derivation-file-names->vhash: adding 6 entries to the cache
debug: ensure-input-derivations-exist: checking for missing input derivations
debug: insert-missing-derivations: inserting inputs
debug: insert-missing-derivations: inserting inputs
debug: Finished inferior-data->package-derivation-ids, took 140 seconds
Successfully loaded 107591 package/derivation pairs
debug: derivation-file-names->derivation-ids: processing 3 derivations
debug: derivation-file-names->vhash: 3 file-names
debug: derivation-file-names->vhash: lookup 3 file-names, 3 not cached
debug: derivation-file-names->vhash: adding 0 entries to the cache
debug: insert-missing-derivations: inserting 3 derivations
debug: insert-missing-derivations: updating hash table
debug: insert-missing-derivations: inserting outputs
debug: insert-missing-derivations: inserting sources
debug: insert-missing-derivations: ensure-input-derivations-exist
debug: ensure-input-derivations-exist: processing 18 derivations
debug: derivation-file-names->vhash: 18 file-names
debug: derivation-file-names->vhash: lookup 18 file-names, 18 not cached
debug: derivation-file-names->vhash: adding 9 entries to the cache
debug: ensure-input-derivations-exist: checking for missing input derivations
debug: insert-missing-derivations: inserting 9 derivations
debug: insert-missing-derivations: updating hash table
debug: insert-missing-derivations: inserting outputs
debug: insert-missing-derivations: inserting sources
debug: insert-missing-derivations: ensure-input-derivations-exist
debug: ensure-input-derivations-exist: processing 54 derivations
debug: derivation-file-names->vhash: 54 file-names
debug: derivation-file-names->vhash: lookup 54 file-names, 48 not cached
debug: derivation-file-names->vhash: adding 27 entries to the cache
debug: ensure-input-derivations-exist: checking for missing input derivations
debug: insert-missing-derivations: inserting 21 derivations
debug: insert-missing-derivations: updating hash table
debug: insert-missing-derivations: inserting outputs
debug: insert-missing-derivations: inserting sources
debug: insert-missing-derivations: ensure-input-derivations-exist
debug: ensure-input-derivations-exist: processing 84 derivations
debug: derivation-file-names->vhash: 84 file-names
debug: derivation-file-names->vhash: lookup 84 file-names, 72 not cached
debug: derivation-file-names->vhash: adding 51 entries to the cache
debug: ensure-input-derivations-exist: checking for missing input derivations
debug: insert-missing-derivations: inserting 21 derivations
debug: insert-missing-derivations: updating hash table
debug: insert-missing-derivations: inserting outputs
debug: insert-missing-derivations: inserting sources
debug: insert-missing-derivations: ensure-input-derivations-exist
debug: ensure-input-derivations-exist: processing 84 derivations
debug: derivation-file-names->vhash: 84 file-names
debug: derivation-file-names->vhash: lookup 84 file-names, 15 not cached
debug: derivation-file-names->vhash: adding 12 entries to the cache
debug: ensure-input-derivations-exist: checking for missing input derivations
debug: insert-missing-derivations: inserting 3 derivations
debug: insert-missing-derivations: updating hash table
debug: insert-missing-derivations: inserting outputs
debug: insert-missing-derivations: inserting sources
debug: insert-missing-derivations: ensure-input-derivations-exist
debug: ensure-input-derivations-exist: processing 12 derivations
debug: derivation-file-names->vhash: 12 file-names
debug: derivation-file-names->vhash: lookup 12 file-names, 9 not cached
debug: derivation-file-names->vhash: adding 9 entries to the cache
debug: ensure-input-derivations-exist: checking for missing input derivations
debug: insert-missing-derivations: inserting inputs
debug: insert-missing-derivations: inserting inputs
debug: insert-missing-derivations: inserting inputs
debug: insert-missing-derivations: inserting inputs
debug: insert-missing-derivations: inserting inputs
debug: Starting inserting channel news entries
debug: Finished inserting channel news entries, took 4 seconds
debug: Starting deleting package derivation entries for master
debug: Finished deleting package derivation entries for master, took 17 seconds
debug: Starting inserting package derivation entries for master
debug: Finished inserting package derivation entries for master, took 652 seconds